{"text_format":"3","workbook":"xlsx","n_sheets":6,"sheets":["Buiséad","Taifead Costais","Cairt Phíog","Caiteachais Grúpáilte","Nótaí","formula"],"not_rendered":{"charts":2,"defined_names":1,"comments":1},"read":"whole","date_system":"1900"}

{"sheet":"Buiséad","index":0,"n_rows":55,"n_cols":7,"rows_kept":55,"merged":[[1,4,1,5]]}
[]
[{"$nulls":3},"Buiséad Míosúil do ","mí bliain"]
[]
[]
[{"$nulls":3},"Cistí atá ar Fáil"]
[{"$nulls":3},"cur síos",{"v":125,"d":"125.00"},null,"Líon isteach na réimsí buí.   "]
[{"$nulls":6},"Féach an chéad chluaisín eile le haghaidh costais.   "]
[]
[]
[]
[]
[{"$nulls":3},"Iomlán atá ar Fáil:",{"$f":"SUM(E6:E11)","v":{"v":125,"d":"125.00"}}]
[]
[]
[{"$nulls":4},"Iomlán atá ar Fáil","Iomlán a Chaitear","Iomlán atá Fágtha"]
[{"$nulls":4},{"$f":"E12","v":{"v":125,"d":"125.00"}},{"$f":"SUM(F19:F53)","v":{"v":1.1,"d":"1.10"}},{"$f":"E16-ABS(F16)","v":{"v":123.9,"d":"123.90"}}]
[]
[{"$nulls":3},"Catagóir","Méid Sannta","Méid a Caitear","Méid atá Fágtha"]
[null,null,1,"Catagóir shamplach",{"v":2,"d":"2.00"},{"$f":"IF(D19=\"\",\"\",SUMIF('Taifead Costais'!A:A,D19,'Taifead Costais'!C:C))","v":{"v":1.1,"d":"1.10"}},{"$f":"IF(D19=\"\",\"\",E19-ABS(F19))","v":{"v":0.9,"d":"0.90"}}]
[null,null,2,"morgáiste",null,{"$f":"IF(D20=\"\",\"\",SUMIF('Taifead Costais'!A:A,D20,'Taifead Costais'!C:C))","v":{"v":0,"d":"0.00"}},{"$f":"IF(D20=\"\",\"\",E20-ABS(F20))","v":{"v":0,"d":"0.00"}}]
[null,null,3,"peitreal",null,{"$f":"IF(D21=\"\",\"\",SUMIF('Taifead Costais'!A:A,D21,'Taifead Costais'!C:C))","v":{"v":0,"d":"0.00"}},{"$f":"IF(D21=\"\",\"\",E21-ABS(F21))","v":{"v":0,"d":"0.00"}}]
[null,null,4,"earraí grósaera",null,{"$f":"IF(D22=\"\",\"\",SUMIF('Taifead Costais'!A:A,D22,'Taifead Costais'!C:C))","v":{"v":0,"d":"0.00"}},{"$f":"IF(D22=\"\",\"\",E22-ABS(F22))","v":{"v":0,"d":"0.00"}}]
[null,null,5,"bialanna",null,{"$f":"IF(D23=\"\",\"\",SUMIF('Taifead Costais'!A:A,D23,'Taifead Costais'!C:C))","v":{"v":0,"d":"0.00"}},{"$f":"IF(D23=\"\",\"\",E23-ABS(F23))","v":{"v":0,"d":"0.00"}}]
[null,null,6,null,null,{"$f":"IF(D24=\"\",\"\",SUMIF('Taifead Costais'!A:A,D24,'Taifead Costais'!C:C))","v":""},{"$f":"IF(D24=\"\",\"\",E24-ABS(F24))","v":""}]
[null,null,7,null,null,{"$f":"IF(D25=\"\",\"\",SUMIF('Taifead Costais'!A:A,D25,'Taifead Costais'!C:C))","v":""},{"$f":"IF(D25=\"\",\"\",E25-ABS(F25))","v":""}]
[null,null,8,null,null,{"$f":"IF(D26=\"\",\"\",SUMIF('Taifead Costais'!A:A,D26,'Taifead Costais'!C:C))","v":""},{"$f":"IF(D26=\"\",\"\",E26-ABS(F26))","v":""}]
[null,null,9,null,null,{"$f":"IF(D27=\"\",\"\",SUMIF('Taifead Costais'!A:A,D27,'Taifead Costais'!C:C))","v":""},{"$f":"IF(D27=\"\",\"\",E27-ABS(F27))","v":""}]
[null,null,10,null,null,{"$f":"IF(D28=\"\",\"\",SUMIF('Taifead Costais'!A:A,D28,'Taifead Costais'!C:C))","v":""},{"$f":"IF(D28=\"\",\"\",E28-ABS(F28))","v":""}]
[null,null,11,null,null,{"$f":"IF(D29=\"\",\"\",SUMIF('Taifead Costais'!A:A,D29,'Taifead Costais'!C:C))","v":""},{"$f":"IF(D29=\"\",\"\",E29-ABS(F29))","v":""}]
[null,null,12,null,null,{"$f":"IF(D30=\"\",\"\",SUMIF('Taifead Costais'!A:A,D30,'Taifead Costais'!C:C))","v":""},{"$f":"IF(D30=\"\",\"\",E30-ABS(F30))","v":""}]
[null,null,13,null,null,{"$f":"IF(D31=\"\",\"\",SUMIF('Taifead Costais'!A:A,D31,'Taifead Costais'!C:C))","v":""},{"$f":"IF(D31=\"\",\"\",E31-ABS(F31))","v":""}]
[null,null,14,null,null,{"$f":"IF(D32=\"\",\"\",SUMIF('Taifead Costais'!A:A,D32,'Taifead Costais'!C:C))","v":""},{"$f":"IF(D32=\"\",\"\",E32-ABS(F32))","v":""}]
[null,null,15,null,null,{"$f":"IF(D33=\"\",\"\",SUMIF('Taifead Costais'!A:A,D33,'Taifead Costais'!C:C))","v":""},{"$f":"IF(D33=\"\",\"\",E33-ABS(F33))","v":""}]
[null,null,16,null,null,{"$f":"IF(D34=\"\",\"\",SUMIF('Taifead Costais'!A:A,D34,'Taifead Costais'!C:C))","v":""},{"$f":"IF(D34=\"\",\"\",E34-ABS(F34))","v":""}]
[null,null,17,null,null,{"$f":"IF(D35=\"\",\"\",SUMIF('Taifead Costais'!A:A,D35,'Taifead Costais'!C:C))","v":""},{"$f":"IF(D35=\"\",\"\",E35-ABS(F35))","v":""}]
[null,null,18,null,null,{"$f":"IF(D36=\"\",\"\",SUMIF('Taifead Costais'!A:A,D36,'Taifead Costais'!C:C))","v":""},{"$f":"IF(D36=\"\",\"\",E36-ABS(F36))","v":""}]
[null,null,19,null,null,{"$f":"IF(D37=\"\",\"\",SUMIF('Taifead Costais'!A:A,D37,'Taifead Costais'!C:C))","v":""},{"$f":"IF(D37=\"\",\"\",E37-ABS(F37))","v":""}]
[null,null,20,null,null,{"$f":"IF(D38=\"\",\"\",SUMIF('Taifead Costais'!A:A,D38,'Taifead Costais'!C:C))","v":""},{"$f":"IF(D38=\"\",\"\",E38-ABS(F38))","v":""}]
[null,null,21,null,null,{"$f":"IF(D39=\"\",\"\",SUMIF('Taifead Costais'!A:A,D39,'Taifead Costais'!C:C))","v":""},{"$f":"IF(D39=\"\",\"\",E39-ABS(F39))","v":""}]
[null,null,22,null,null,{"$f":"IF(D40=\"\",\"\",SUMIF('Taifead Costais'!A:A,D40,'Taifead Costais'!C:C))","v":""},{"$f":"IF(D40=\"\",\"\",E40-ABS(F40))","v":""}]
[null,null,23,null,null,{"$f":"IF(D41=\"\",\"\",SUMIF('Taifead Costais'!A:A,D41,'Taifead Costais'!C:C))","v":""},{"$f":"IF(D41=\"\",\"\",E41-ABS(F41))","v":""}]
[null,null,24,null,null,{"$f":"IF(D42=\"\",\"\",SUMIF('Taifead Costais'!A:A,D42,'Taifead Costais'!C:C))","v":""},{"$f":"IF(D42=\"\",\"\",E42-ABS(F42))","v":""}]
[null,null,25,null,null,{"$f":"IF(D43=\"\",\"\",SUMIF('Taifead Costais'!A:A,D43,'Taifead Costais'!C:C))","v":""},{"$f":"IF(D43=\"\",\"\",E43-ABS(F43))","v":""}]
[null,null,26,null,null,{"$f":"IF(D44=\"\",\"\",SUMIF('Taifead Costais'!A:A,D44,'Taifead Costais'!C:C))","v":""},{"$f":"IF(D44=\"\",\"\",E44-ABS(F44))","v":""}]
[null,null,27,null,null,{"$f":"IF(D45=\"\",\"\",SUMIF('Taifead Costais'!A:A,D45,'Taifead Costais'!C:C))","v":""},{"$f":"IF(D45=\"\",\"\",E45-ABS(F45))","v":""}]
[null,null,28,null,null,{"$f":"IF(D46=\"\",\"\",SUMIF('Taifead Costais'!A:A,D46,'Taifead Costais'!C:C))","v":""},{"$f":"IF(D46=\"\",\"\",E46-ABS(F46))","v":""}]
[null,null,29,null,null,{"$f":"IF(D47=\"\",\"\",SUMIF('Taifead Costais'!A:A,D47,'Taifead Costais'!C:C))","v":""},{"$f":"IF(D47=\"\",\"\",E47-ABS(F47))","v":""}]
[null,null,30,null,null,{"$f":"IF(D48=\"\",\"\",SUMIF('Taifead Costais'!A:A,D48,'Taifead Costais'!C:C))","v":""},{"$f":"IF(D48=\"\",\"\",E48-ABS(F48))","v":""}]
[null,null,31,null,null,{"$f":"IF(D49=\"\",\"\",SUMIF('Taifead Costais'!A:A,D49,'Taifead Costais'!C:C))","v":""},{"$f":"IF(D49=\"\",\"\",E49-ABS(F49))","v":""}]
[null,null,32,null,null,{"$f":"IF(D50=\"\",\"\",SUMIF('Taifead Costais'!A:A,D50,'Taifead Costais'!C:C))","v":""},{"$f":"IF(D50=\"\",\"\",E50-ABS(F50))","v":""}]
[null,null,33,null,null,{"$f":"IF(D51=\"\",\"\",SUMIF('Taifead Costais'!A:A,D51,'Taifead Costais'!C:C))","v":""},{"$f":"IF(D51=\"\",\"\",E51-ABS(F51))","v":""}]
[null,null,34,null,null,{"$f":"IF(D52=\"\",\"\",SUMIF('Taifead Costais'!A:A,D52,'Taifead Costais'!C:C))","v":""},{"$f":"IF(D52=\"\",\"\",E52-ABS(F52))","v":""}]
[null,null,35,null," ",{"$f":"IF(D53=\"\",\"\",SUMIF('Taifead Costais'!A:A,D53,'Taifead Costais'!C:C))","v":""},{"$f":"IF(D53=\"\",\"\",E53-ABS(F53))","v":""}]
[]
[{"$nulls":3},"Iomlán sannta:",{"$f":"SUM(E19:E53)","v":{"v":2,"d":"2.00"}}]

{"sheet":"Taifead Costais","index":1,"n_rows":750,"n_cols":7,"rows_kept":750,"merged":[[1,2,1,4]]}
["Taifead Costais"]
[null,null,"1) Cuir isteach méid do gach costas (nó cóipeáil agus greamaigh ó do bhanc)"]
["2) Roghnaigh catagóir do gach costas thíos"]
[null,"Expenses","Méideanna Costais","Cur Síos / nótaí","Expenses","Expenses","Expenses"]
[]
["Catagóir shamplach",null,{"v":1.1,"d":"1.10"}]
{"$rows_empty":743}
[null," "]

{"sheet":"Cairt Phíog","index":2,"n_rows":36,"n_cols":10,"rows_kept":36}
["Rank","Rank + tiebreaker","true rank","Category","Expense Totals","Percent",null,"Catagóir","Iomláin Costais","Céatadán"]
[{"$f":"IF(E2=\"\",\"\",RANK(E2,$E$2:$E$36))","v":1},{"$f":"IF(A2=\"\",\"\",A2+ROW()/1000)","v":1.002},{"$f":"IF(B2=\"\",\"\",RANK(B2,$B$2:$B$36,1))","v":1},{"$f":"IF(Buiséad!D19=\"\",\"\",Buiséad!D19)","v":"Catagóir shamplach"},{"$f":"IF(D2=\"\",\"\",ABS(Buiséad!F19))","v":{"v":1.1,"d":"1.10"}},{"$f":"IF(E2=\"\",\"\",E2/SUM($E$2:$E$36))","v":{"v":1,"d":"100.00%"}},null,{"$f":"IFERROR(VLOOKUP(ROW()-1,$C$2:$F$36,2,0),\"\")","v":"Catagóir shamplach"},{"$f":"IFERROR(VLOOKUP(ROW()-1,$C$2:$F$36,3,0),\"\")","v":{"v":1.1,"d":"1.10"}},{"$f":"IFERROR(VLOOKUP(ROW()-1,$C$2:$F$36,4,0),\"\")","v":{"v":1,"d":"100.0%"}}]
[{"$f":"IF(E3=\"\",\"\",RANK(E3,$E$2:$E$36))","v":2},{"$f":"IF(A3=\"\",\"\",A3+ROW()/1000)","v":2.003},{"$f":"IF(B3=\"\",\"\",RANK(B3,$B$2:$B$36,1))","v":2},{"$f":"IF(Buiséad!D20=\"\",\"\",Buiséad!D20)","v":"morgáiste"},{"$f":"IF(D3=\"\",\"\",ABS(Buiséad!F20))","v":{"v":0,"d":"0.00"}},{"$f":"IF(E3=\"\",\"\",E3/SUM($E$2:$E$36))","v":{"v":0,"d":"0.0%"}},null,{"$f":"IFERROR(VLOOKUP(ROW()-1,$C$2:$F$36,2,0),\"\")","v":"morgáiste"},{"$f":"IFERROR(VLOOKUP(ROW()-1,$C$2:$F$36,3,0),\"\")","v":{"v":0,"d":"0.00"}},{"$f":"IFERROR(VLOOKUP(ROW()-1,$C$2:$F$36,4,0),\"\")","v":{"v":0,"d":"0.0%"}}]
[{"$f":"IF(E4=\"\",\"\",RANK(E4,$E$2:$E$36))","v":2},{"$f":"IF(A4=\"\",\"\",A4+ROW()/1000)","v":2.004},{"$f":"IF(B4=\"\",\"\",RANK(B4,$B$2:$B$36,1))","v":3},{"$f":"IF(Buiséad!D21=\"\",\"\",Buiséad!D21)","v":"peitreal"},{"$f":"IF(D4=\"\",\"\",ABS(Buiséad!F21))","v":{"v":0,"d":"0.00"}},{"$f":"IF(E4=\"\",\"\",E4/SUM($E$2:$E$36))","v":{"v":0,"d":"0.0%"}},null,{"$f":"IFERROR(VLOOKUP(ROW()-1,$C$2:$F$36,2,0),\"\")","v":"peitreal"},{"$f":"IFERROR(VLOOKUP(ROW()-1,$C$2:$F$36,3,0),\"\")","v":{"v":0,"d":"0.00"}},{"$f":"IFERROR(VLOOKUP(ROW()-1,$C$2:$F$36,4,0),\"\")","v":{"v":0,"d":"0.0%"}}]
[{"$f":"IF(E5=\"\",\"\",RANK(E5,$E$2:$E$36))","v":2},{"$f":"IF(A5=\"\",\"\",A5+ROW()/1000)","v":2.005},{"$f":"IF(B5=\"\",\"\",RANK(B5,$B$2:$B$36,1))","v":4},{"$f":"IF(Buiséad!D22=\"\",\"\",Buiséad!D22)","v":"earraí grósaera"},{"$f":"IF(D5=\"\",\"\",ABS(Buiséad!F22))","v":{"v":0,"d":"0.00"}},{"$f":"IF(E5=\"\",\"\",E5/SUM($E$2:$E$36))","v":{"v":0,"d":"0.0%"}},null,{"$f":"IFERROR(VLOOKUP(ROW()-1,$C$2:$F$36,2,0),\"\")","v":"earraí grósaera"},{"$f":"IFERROR(VLOOKUP(ROW()-1,$C$2:$F$36,3,0),\"\")","v":{"v":0,"d":"0.00"}},{"$f":"IFERROR(VLOOKUP(ROW()-1,$C$2:$F$36,4,0),\"\")","v":{"v":0,"d":"0.0%"}}]
[{"$f":"IF(E6=\"\",\"\",RANK(E6,$E$2:$E$36))","v":2},{"$f":"IF(A6=\"\",\"\",A6+ROW()/1000)","v":2.006},{"$f":"IF(B6=\"\",\"\",RANK(B6,$B$2:$B$36,1))","v":5},{"$f":"IF(Buiséad!D23=\"\",\"\",Buiséad!D23)","v":"bialanna"},{"$f":"IF(D6=\"\",\"\",ABS(Buiséad!F23))","v":{"v":0,"d":"0.00"}},{"$f":"IF(E6=\"\",\"\",E6/SUM($E$2:$E$36))","v":{"v":0,"d":"0.0%"}},null,{"$f":"IFERROR(VLOOKUP(ROW()-1,$C$2:$F$36,2,0),\"\")","v":"bialanna"},{"$f":"IFERROR(VLOOKUP(ROW()-1,$C$2:$F$36,3,0),\"\")","v":{"v":0,"d":"0.00"}},{"$f":"IFERROR(VLOOKUP(ROW()-1,$C$2:$F$36,4,0),\"\")","v":{"v":0,"d":"0.0%"}}]
[{"$f":"IF(E7=\"\",\"\",RANK(E7,$E$2:$E$36))","v":""},{"$f":"IF(A7=\"\",\"\",A7+ROW()/1000)","v":""},{"$f":"IF(B7=\"\",\"\",RANK(B7,$B$2:$B$36,1))","v":""},{"$f":"IF(Buiséad!D24=\"\",\"\",Buiséad!D24)","v":""},{"$f":"IF(D7=\"\",\"\",ABS(Buiséad!F24))","v":""},{"$f":"IF(E7=\"\",\"\",E7/SUM($E$2:$E$36))","v":""},null,{"$f":"IFERROR(VLOOKUP(ROW()-1,$C$2:$F$36,2,0),\"\")","v":""},{"$f":"IFERROR(VLOOKUP(ROW()-1,$C$2:$F$36,3,0),\"\")","v":""},{"$f":"IFERROR(VLOOKUP(ROW()-1,$C$2:$F$36,4,0),\"\")","v":""}]
[{"$f":"IF(E8=\"\",\"\",RANK(E8,$E$2:$E$36))","v":""},{"$f":"IF(A8=\"\",\"\",A8+ROW()/1000)","v":""},{"$f":"IF(B8=\"\",\"\",RANK(B8,$B$2:$B$36,1))","v":""},{"$f":"IF(Buiséad!D25=\"\",\"\",Buiséad!D25)","v":""},{"$f":"IF(D8=\"\",\"\",ABS(Buiséad!F25))","v":""},{"$f":"IF(E8=\"\",\"\",E8/SUM($E$2:$E$36))","v":""},null,{"$f":"IFERROR(VLOOKUP(ROW()-1,$C$2:$F$36,2,0),\"\")","v":""},{"$f":"IFERROR(VLOOKUP(ROW()-1,$C$2:$F$36,3,0),\"\")","v":""},{"$f":"IFERROR(VLOOKUP(ROW()-1,$C$2:$F$36,4,0),\"\")","v":""}]
[{"$f":"IF(E9=\"\",\"\",RANK(E9,$E$2:$E$36))","v":""},{"$f":"IF(A9=\"\",\"\",A9+ROW()/1000)","v":""},{"$f":"IF(B9=\"\",\"\",RANK(B9,$B$2:$B$36,1))","v":""},{"$f":"IF(Buiséad!D26=\"\",\"\",Buiséad!D26)","v":""},{"$f":"IF(D9=\"\",\"\",ABS(Buiséad!F26))","v":""},{"$f":"IF(E9=\"\",\"\",E9/SUM($E$2:$E$36))","v":""},null,{"$f":"IFERROR(VLOOKUP(ROW()-1,$C$2:$F$36,2,0),\"\")","v":""},{"$f":"IFERROR(VLOOKUP(ROW()-1,$C$2:$F$36,3,0),\"\")","v":""},{"$f":"IFERROR(VLOOKUP(ROW()-1,$C$2:$F$36,4,0),\"\")","v":""}]
[{"$f":"IF(E10=\"\",\"\",RANK(E10,$E$2:$E$36))","v":""},{"$f":"IF(A10=\"\",\"\",A10+ROW()/1000)","v":""},{"$f":"IF(B10=\"\",\"\",RANK(B10,$B$2:$B$36,1))","v":""},{"$f":"IF(Buiséad!D27=\"\",\"\",Buiséad!D27)","v":""},{"$f":"IF(D10=\"\",\"\",ABS(Buiséad!F27))","v":""},{"$f":"IF(E10=\"\",\"\",E10/SUM($E$2:$E$36))","v":""},null,{"$f":"IFERROR(VLOOKUP(ROW()-1,$C$2:$F$36,2,0),\"\")","v":""},{"$f":"IFERROR(VLOOKUP(ROW()-1,$C$2:$F$36,3,0),\"\")","v":""},{"$f":"IFERROR(VLOOKUP(ROW()-1,$C$2:$F$36,4,0),\"\")","v":""}]
[{"$f":"IF(E11=\"\",\"\",RANK(E11,$E$2:$E$36))","v":""},{"$f":"IF(A11=\"\",\"\",A11+ROW()/1000)","v":""},{"$f":"IF(B11=\"\",\"\",RANK(B11,$B$2:$B$36,1))","v":""},{"$f":"IF(Buiséad!D28=\"\",\"\",Buiséad!D28)","v":""},{"$f":"IF(D11=\"\",\"\",ABS(Buiséad!F28))","v":""},{"$f":"IF(E11=\"\",\"\",E11/SUM($E$2:$E$36))","v":""},null,{"$f":"IFERROR(VLOOKUP(ROW()-1,$C$2:$F$36,2,0),\"\")","v":""},{"$f":"IFERROR(VLOOKUP(ROW()-1,$C$2:$F$36,3,0),\"\")","v":""},{"$f":"IFERROR(VLOOKUP(ROW()-1,$C$2:$F$36,4,0),\"\")","v":""}]
[{"$f":"IF(E12=\"\",\"\",RANK(E12,$E$2:$E$36))","v":""},{"$f":"IF(A12=\"\",\"\",A12+ROW()/1000)","v":""},{"$f":"IF(B12=\"\",\"\",RANK(B12,$B$2:$B$36,1))","v":""},{"$f":"IF(Buiséad!D29=\"\",\"\",Buiséad!D29)","v":""},{"$f":"IF(D12=\"\",\"\",ABS(Buiséad!F29))","v":""},{"$f":"IF(E12=\"\",\"\",E12/SUM($E$2:$E$36))","v":""},null,{"$f":"IFERROR(VLOOKUP(ROW()-1,$C$2:$F$36,2,0),\"\")","v":""},{"$f":"IFERROR(VLOOKUP(ROW()-1,$C$2:$F$36,3,0),\"\")","v":""},{"$f":"IFERROR(VLOOKUP(ROW()-1,$C$2:$F$36,4,0),\"\")","v":""}]
[{"$f":"IF(E13=\"\",\"\",RANK(E13,$E$2:$E$36))","v":""},{"$f":"IF(A13=\"\",\"\",A13+ROW()/1000)","v":""},{"$f":"IF(B13=\"\",\"\",RANK(B13,$B$2:$B$36,1))","v":""},{"$f":"IF(Buiséad!D30=\"\",\"\",Buiséad!D30)","v":""},{"$f":"IF(D13=\"\",\"\",ABS(Buiséad!F30))","v":""},{"$f":"IF(E13=\"\",\"\",E13/SUM($E$2:$E$36))","v":""},null,{"$f":"IFERROR(VLOOKUP(ROW()-1,$C$2:$F$36,2,0),\"\")","v":""},{"$f":"IFERROR(VLOOKUP(ROW()-1,$C$2:$F$36,3,0),\"\")","v":""},{"$f":"IFERROR(VLOOKUP(ROW()-1,$C$2:$F$36,4,0),\"\")","v":""}]
[{"$f":"IF(E14=\"\",\"\",RANK(E14,$E$2:$E$36))","v":""},{"$f":"IF(A14=\"\",\"\",A14+ROW()/1000)","v":""},{"$f":"IF(B14=\"\",\"\",RANK(B14,$B$2:$B$36,1))","v":""},{"$f":"IF(Buiséad!D31=\"\",\"\",Buiséad!D31)","v":""},{"$f":"IF(D14=\"\",\"\",ABS(Buiséad!F31))","v":""},{"$f":"IF(E14=\"\",\"\",E14/SUM($E$2:$E$36))","v":""},null,{"$f":"IFERROR(VLOOKUP(ROW()-1,$C$2:$F$36,2,0),\"\")","v":""},{"$f":"IFERROR(VLOOKUP(ROW()-1,$C$2:$F$36,3,0),\"\")","v":""},{"$f":"IFERROR(VLOOKUP(ROW()-1,$C$2:$F$36,4,0),\"\")","v":""}]
[{"$f":"IF(E15=\"\",\"\",RANK(E15,$E$2:$E$36))","v":""},{"$f":"IF(A15=\"\",\"\",A15+ROW()/1000)","v":""},{"$f":"IF(B15=\"\",\"\",RANK(B15,$B$2:$B$36,1))","v":""},{"$f":"IF(Buiséad!D32=\"\",\"\",Buiséad!D32)","v":""},{"$f":"IF(D15=\"\",\"\",ABS(Buiséad!F32))","v":""},{"$f":"IF(E15=\"\",\"\",E15/SUM($E$2:$E$36))","v":""},null,{"$f":"IFERROR(VLOOKUP(ROW()-1,$C$2:$F$36,2,0),\"\")","v":""},{"$f":"IFERROR(VLOOKUP(ROW()-1,$C$2:$F$36,3,0),\"\")","v":""},{"$f":"IFERROR(VLOOKUP(ROW()-1,$C$2:$F$36,4,0),\"\")","v":""}]
[{"$f":"IF(E16=\"\",\"\",RANK(E16,$E$2:$E$36))","v":""},{"$f":"IF(A16=\"\",\"\",A16+ROW()/1000)","v":""},{"$f":"IF(B16=\"\",\"\",RANK(B16,$B$2:$B$36,1))","v":""},{"$f":"IF(Buiséad!D33=\"\",\"\",Buiséad!D33)","v":""},{"$f":"IF(D16=\"\",\"\",ABS(Buiséad!F33))","v":""},{"$f":"IF(E16=\"\",\"\",E16/SUM($E$2:$E$36))","v":""},null,{"$f":"IFERROR(VLOOKUP(ROW()-1,$C$2:$F$36,2,0),\"\")","v":""},{"$f":"IFERROR(VLOOKUP(ROW()-1,$C$2:$F$36,3,0),\"\")","v":""},{"$f":"IFERROR(VLOOKUP(ROW()-1,$C$2:$F$36,4,0),\"\")","v":""}]
[{"$f":"IF(E17=\"\",\"\",RANK(E17,$E$2:$E$36))","v":""},{"$f":"IF(A17=\"\",\"\",A17+ROW()/1000)","v":""},{"$f":"IF(B17=\"\",\"\",RANK(B17,$B$2:$B$36,1))","v":""},{"$f":"IF(Buiséad!D34=\"\",\"\",Buiséad!D34)","v":""},{"$f":"IF(D17=\"\",\"\",ABS(Buiséad!F34))","v":""},{"$f":"IF(E17=\"\",\"\",E17/SUM($E$2:$E$36))","v":""},null,{"$f":"IFERROR(VLOOKUP(ROW()-1,$C$2:$F$36,2,0),\"\")","v":""},{"$f":"IFERROR(VLOOKUP(ROW()-1,$C$2:$F$36,3,0),\"\")","v":""},{"$f":"IFERROR(VLOOKUP(ROW()-1,$C$2:$F$36,4,0),\"\")","v":""}]
[{"$f":"IF(E18=\"\",\"\",RANK(E18,$E$2:$E$36))","v":""},{"$f":"IF(A18=\"\",\"\",A18+ROW()/1000)","v":""},{"$f":"IF(B18=\"\",\"\",RANK(B18,$B$2:$B$36,1))","v":""},{"$f":"IF(Buiséad!D35=\"\",\"\",Buiséad!D35)","v":""},{"$f":"IF(D18=\"\",\"\",ABS(Buiséad!F35))","v":""},{"$f":"IF(E18=\"\",\"\",E18/SUM($E$2:$E$36))","v":""},null,{"$f":"IFERROR(VLOOKUP(ROW()-1,$C$2:$F$36,2,0),\"\")","v":""},{"$f":"IFERROR(VLOOKUP(ROW()-1,$C$2:$F$36,3,0),\"\")","v":""},{"$f":"IFERROR(VLOOKUP(ROW()-1,$C$2:$F$36,4,0),\"\")","v":""}]
[{"$f":"IF(E19=\"\",\"\",RANK(E19,$E$2:$E$36))","v":""},{"$f":"IF(A19=\"\",\"\",A19+ROW()/1000)","v":""},{"$f":"IF(B19=\"\",\"\",RANK(B19,$B$2:$B$36,1))","v":""},{"$f":"IF(Buiséad!D36=\"\",\"\",Buiséad!D36)","v":""},{"$f":"IF(D19=\"\",\"\",ABS(Buiséad!F36))","v":""},{"$f":"IF(E19=\"\",\"\",E19/SUM($E$2:$E$36))","v":""},null,{"$f":"IFERROR(VLOOKUP(ROW()-1,$C$2:$F$36,2,0),\"\")","v":""},{"$f":"IFERROR(VLOOKUP(ROW()-1,$C$2:$F$36,3,0),\"\")","v":""},{"$f":"IFERROR(VLOOKUP(ROW()-1,$C$2:$F$36,4,0),\"\")","v":""}]
[{"$f":"IF(E20=\"\",\"\",RANK(E20,$E$2:$E$36))","v":""},{"$f":"IF(A20=\"\",\"\",A20+ROW()/1000)","v":""},{"$f":"IF(B20=\"\",\"\",RANK(B20,$B$2:$B$36,1))","v":""},{"$f":"IF(Buiséad!D37=\"\",\"\",Buiséad!D37)","v":""},{"$f":"IF(D20=\"\",\"\",ABS(Buiséad!F37))","v":""},{"$f":"IF(E20=\"\",\"\",E20/SUM($E$2:$E$36))","v":""},null,{"$f":"IFERROR(VLOOKUP(ROW()-1,$C$2:$F$36,2,0),\"\")","v":""},{"$f":"IFERROR(VLOOKUP(ROW()-1,$C$2:$F$36,3,0),\"\")","v":""},{"$f":"IFERROR(VLOOKUP(ROW()-1,$C$2:$F$36,4,0),\"\")","v":""}]
[{"$f":"IF(E21=\"\",\"\",RANK(E21,$E$2:$E$36))","v":""},{"$f":"IF(A21=\"\",\"\",A21+ROW()/1000)","v":""},{"$f":"IF(B21=\"\",\"\",RANK(B21,$B$2:$B$36,1))","v":""},{"$f":"IF(Buiséad!D38=\"\",\"\",Buiséad!D38)","v":""},{"$f":"IF(D21=\"\",\"\",ABS(Buiséad!F38))","v":""},{"$f":"IF(E21=\"\",\"\",E21/SUM($E$2:$E$36))","v":""},null,{"$f":"IFERROR(VLOOKUP(ROW()-1,$C$2:$F$36,2,0),\"\")","v":""},{"$f":"IFERROR(VLOOKUP(ROW()-1,$C$2:$F$36,3,0),\"\")","v":""},{"$f":"IFERROR(VLOOKUP(ROW()-1,$C$2:$F$36,4,0),\"\")","v":""}]
[{"$f":"IF(E22=\"\",\"\",RANK(E22,$E$2:$E$36))","v":""},{"$f":"IF(A22=\"\",\"\",A22+ROW()/1000)","v":""},{"$f":"IF(B22=\"\",\"\",RANK(B22,$B$2:$B$36,1))","v":""},{"$f":"IF(Buiséad!D39=\"\",\"\",Buiséad!D39)","v":""},{"$f":"IF(D22=\"\",\"\",ABS(Buiséad!F39))","v":""},{"$f":"IF(E22=\"\",\"\",E22/SUM($E$2:$E$36))","v":""},null,{"$f":"IFERROR(VLOOKUP(ROW()-1,$C$2:$F$36,2,0),\"\")","v":""},{"$f":"IFERROR(VLOOKUP(ROW()-1,$C$2:$F$36,3,0),\"\")","v":""},{"$f":"IFERROR(VLOOKUP(ROW()-1,$C$2:$F$36,4,0),\"\")","v":""}]
[{"$f":"IF(E23=\"\",\"\",RANK(E23,$E$2:$E$36))","v":""},{"$f":"IF(A23=\"\",\"\",A23+ROW()/1000)","v":""},{"$f":"IF(B23=\"\",\"\",RANK(B23,$B$2:$B$36,1))","v":""},{"$f":"IF(Buiséad!D40=\"\",\"\",Buiséad!D40)","v":""},{"$f":"IF(D23=\"\",\"\",ABS(Buiséad!F40))","v":""},{"$f":"IF(E23=\"\",\"\",E23/SUM($E$2:$E$36))","v":""},null,{"$f":"IFERROR(VLOOKUP(ROW()-1,$C$2:$F$36,2,0),\"\")","v":""},{"$f":"IFERROR(VLOOKUP(ROW()-1,$C$2:$F$36,3,0),\"\")","v":""},{"$f":"IFERROR(VLOOKUP(ROW()-1,$C$2:$F$36,4,0),\"\")","v":""}]
[{"$f":"IF(E24=\"\",\"\",RANK(E24,$E$2:$E$36))","v":""},{"$f":"IF(A24=\"\",\"\",A24+ROW()/1000)","v":""},{"$f":"IF(B24=\"\",\"\",RANK(B24,$B$2:$B$36,1))","v":""},{"$f":"IF(Buiséad!D41=\"\",\"\",Buiséad!D41)","v":""},{"$f":"IF(D24=\"\",\"\",ABS(Buiséad!F41))","v":""},{"$f":"IF(E24=\"\",\"\",E24/SUM($E$2:$E$36))","v":""},null,{"$f":"IFERROR(VLOOKUP(ROW()-1,$C$2:$F$36,2,0),\"\")","v":""},{"$f":"IFERROR(VLOOKUP(ROW()-1,$C$2:$F$36,3,0),\"\")","v":""},{"$f":"IFERROR(VLOOKUP(ROW()-1,$C$2:$F$36,4,0),\"\")","v":""}]
[{"$f":"IF(E25=\"\",\"\",RANK(E25,$E$2:$E$36))","v":""},{"$f":"IF(A25=\"\",\"\",A25+ROW()/1000)","v":""},{"$f":"IF(B25=\"\",\"\",RANK(B25,$B$2:$B$36,1))","v":""},{"$f":"IF(Buiséad!D42=\"\",\"\",Buiséad!D42)","v":""},{"$f":"IF(D25=\"\",\"\",ABS(Buiséad!F42))","v":""},{"$f":"IF(E25=\"\",\"\",E25/SUM($E$2:$E$36))","v":""},null,{"$f":"IFERROR(VLOOKUP(ROW()-1,$C$2:$F$36,2,0),\"\")","v":""},{"$f":"IFERROR(VLOOKUP(ROW()-1,$C$2:$F$36,3,0),\"\")","v":""},{"$f":"IFERROR(VLOOKUP(ROW()-1,$C$2:$F$36,4,0),\"\")","v":""}]
[{"$f":"IF(E26=\"\",\"\",RANK(E26,$E$2:$E$36))","v":""},{"$f":"IF(A26=\"\",\"\",A26+ROW()/1000)","v":""},{"$f":"IF(B26=\"\",\"\",RANK(B26,$B$2:$B$36,1))","v":""},{"$f":"IF(Buiséad!D43=\"\",\"\",Buiséad!D43)","v":""},{"$f":"IF(D26=\"\",\"\",ABS(Buiséad!F43))","v":""},{"$f":"IF(E26=\"\",\"\",E26/SUM($E$2:$E$36))","v":""},null,{"$f":"IFERROR(VLOOKUP(ROW()-1,$C$2:$F$36,2,0),\"\")","v":""},{"$f":"IFERROR(VLOOKUP(ROW()-1,$C$2:$F$36,3,0),\"\")","v":""},{"$f":"IFERROR(VLOOKUP(ROW()-1,$C$2:$F$36,4,0),\"\")","v":""}]
[{"$f":"IF(E27=\"\",\"\",RANK(E27,$E$2:$E$36))","v":""},{"$f":"IF(A27=\"\",\"\",A27+ROW()/1000)","v":""},{"$f":"IF(B27=\"\",\"\",RANK(B27,$B$2:$B$36,1))","v":""},{"$f":"IF(Buiséad!D44=\"\",\"\",Buiséad!D44)","v":""},{"$f":"IF(D27=\"\",\"\",ABS(Buiséad!F44))","v":""},{"$f":"IF(E27=\"\",\"\",E27/SUM($E$2:$E$36))","v":""},null,{"$f":"IFERROR(VLOOKUP(ROW()-1,$C$2:$F$36,2,0),\"\")","v":""},{"$f":"IFERROR(VLOOKUP(ROW()-1,$C$2:$F$36,3,0),\"\")","v":""},{"$f":"IFERROR(VLOOKUP(ROW()-1,$C$2:$F$36,4,0),\"\")","v":""}]
[{"$f":"IF(E28=\"\",\"\",RANK(E28,$E$2:$E$36))","v":""},{"$f":"IF(A28=\"\",\"\",A28+ROW()/1000)","v":""},{"$f":"IF(B28=\"\",\"\",RANK(B28,$B$2:$B$36,1))","v":""},{"$f":"IF(Buiséad!D45=\"\",\"\",Buiséad!D45)","v":""},{"$f":"IF(D28=\"\",\"\",ABS(Buiséad!F45))","v":""},{"$f":"IF(E28=\"\",\"\",E28/SUM($E$2:$E$36))","v":""},null,{"$f":"IFERROR(VLOOKUP(ROW()-1,$C$2:$F$36,2,0),\"\")","v":""},{"$f":"IFERROR(VLOOKUP(ROW()-1,$C$2:$F$36,3,0),\"\")","v":""},{"$f":"IFERROR(VLOOKUP(ROW()-1,$C$2:$F$36,4,0),\"\")","v":""}]
[{"$f":"IF(E29=\"\",\"\",RANK(E29,$E$2:$E$36))","v":""},{"$f":"IF(A29=\"\",\"\",A29+ROW()/1000)","v":""},{"$f":"IF(B29=\"\",\"\",RANK(B29,$B$2:$B$36,1))","v":""},{"$f":"IF(Buiséad!D46=\"\",\"\",Buiséad!D46)","v":""},{"$f":"IF(D29=\"\",\"\",ABS(Buiséad!F46))","v":""},{"$f":"IF(E29=\"\",\"\",E29/SUM($E$2:$E$36))","v":""},null,{"$f":"IFERROR(VLOOKUP(ROW()-1,$C$2:$F$36,2,0),\"\")","v":""},{"$f":"IFERROR(VLOOKUP(ROW()-1,$C$2:$F$36,3,0),\"\")","v":""},{"$f":"IFERROR(VLOOKUP(ROW()-1,$C$2:$F$36,4,0),\"\")","v":""}]
[{"$f":"IF(E30=\"\",\"\",RANK(E30,$E$2:$E$36))","v":""},{"$f":"IF(A30=\"\",\"\",A30+ROW()/1000)","v":""},{"$f":"IF(B30=\"\",\"\",RANK(B30,$B$2:$B$36,1))","v":""},{"$f":"IF(Buiséad!D47=\"\",\"\",Buiséad!D47)","v":""},{"$f":"IF(D30=\"\",\"\",ABS(Buiséad!F47))","v":""},{"$f":"IF(E30=\"\",\"\",E30/SUM($E$2:$E$36))","v":""},null,{"$f":"IFERROR(VLOOKUP(ROW()-1,$C$2:$F$36,2,0),\"\")","v":""},{"$f":"IFERROR(VLOOKUP(ROW()-1,$C$2:$F$36,3,0),\"\")","v":""},{"$f":"IFERROR(VLOOKUP(ROW()-1,$C$2:$F$36,4,0),\"\")","v":""}]
[{"$f":"IF(E31=\"\",\"\",RANK(E31,$E$2:$E$36))","v":""},{"$f":"IF(A31=\"\",\"\",A31+ROW()/1000)","v":""},{"$f":"IF(B31=\"\",\"\",RANK(B31,$B$2:$B$36,1))","v":""},{"$f":"IF(Buiséad!D48=\"\",\"\",Buiséad!D48)","v":""},{"$f":"IF(D31=\"\",\"\",ABS(Buiséad!F48))","v":""},{"$f":"IF(E31=\"\",\"\",E31/SUM($E$2:$E$36))","v":""},null,{"$f":"IFERROR(VLOOKUP(ROW()-1,$C$2:$F$36,2,0),\"\")","v":""},{"$f":"IFERROR(VLOOKUP(ROW()-1,$C$2:$F$36,3,0),\"\")","v":""},{"$f":"IFERROR(VLOOKUP(ROW()-1,$C$2:$F$36,4,0),\"\")","v":""}]
[{"$f":"IF(E32=\"\",\"\",RANK(E32,$E$2:$E$36))","v":""},{"$f":"IF(A32=\"\",\"\",A32+ROW()/1000)","v":""},{"$f":"IF(B32=\"\",\"\",RANK(B32,$B$2:$B$36,1))","v":""},{"$f":"IF(Buiséad!D49=\"\",\"\",Buiséad!D49)","v":""},{"$f":"IF(D32=\"\",\"\",ABS(Buiséad!F49))","v":""},{"$f":"IF(E32=\"\",\"\",E32/SUM($E$2:$E$36))","v":""},null,{"$f":"IFERROR(VLOOKUP(ROW()-1,$C$2:$F$36,2,0),\"\")","v":""},{"$f":"IFERROR(VLOOKUP(ROW()-1,$C$2:$F$36,3,0),\"\")","v":""},{"$f":"IFERROR(VLOOKUP(ROW()-1,$C$2:$F$36,4,0),\"\")","v":""}]
[{"$f":"IF(E33=\"\",\"\",RANK(E33,$E$2:$E$36))","v":""},{"$f":"IF(A33=\"\",\"\",A33+ROW()/1000)","v":""},{"$f":"IF(B33=\"\",\"\",RANK(B33,$B$2:$B$36,1))","v":""},{"$f":"IF(Buiséad!D50=\"\",\"\",Buiséad!D50)","v":""},{"$f":"IF(D33=\"\",\"\",ABS(Buiséad!F50))","v":""},{"$f":"IF(E33=\"\",\"\",E33/SUM($E$2:$E$36))","v":""},null,{"$f":"IFERROR(VLOOKUP(ROW()-1,$C$2:$F$36,2,0),\"\")","v":""},{"$f":"IFERROR(VLOOKUP(ROW()-1,$C$2:$F$36,3,0),\"\")","v":""},{"$f":"IFERROR(VLOOKUP(ROW()-1,$C$2:$F$36,4,0),\"\")","v":""}]
[{"$f":"IF(E34=\"\",\"\",RANK(E34,$E$2:$E$36))","v":""},{"$f":"IF(A34=\"\",\"\",A34+ROW()/1000)","v":""},{"$f":"IF(B34=\"\",\"\",RANK(B34,$B$2:$B$36,1))","v":""},{"$f":"IF(Buiséad!D51=\"\",\"\",Buiséad!D51)","v":""},{"$f":"IF(D34=\"\",\"\",ABS(Buiséad!F51))","v":""},{"$f":"IF(E34=\"\",\"\",E34/SUM($E$2:$E$36))","v":""},null,{"$f":"IFERROR(VLOOKUP(ROW()-1,$C$2:$F$36,2,0),\"\")","v":""},{"$f":"IFERROR(VLOOKUP(ROW()-1,$C$2:$F$36,3,0),\"\")","v":""},{"$f":"IFERROR(VLOOKUP(ROW()-1,$C$2:$F$36,4,0),\"\")","v":""}]
[{"$f":"IF(E35=\"\",\"\",RANK(E35,$E$2:$E$36))","v":""},{"$f":"IF(A35=\"\",\"\",A35+ROW()/1000)","v":""},{"$f":"IF(B35=\"\",\"\",RANK(B35,$B$2:$B$36,1))","v":""},{"$f":"IF(Buiséad!D52=\"\",\"\",Buiséad!D52)","v":""},{"$f":"IF(D35=\"\",\"\",ABS(Buiséad!F52))","v":""},{"$f":"IF(E35=\"\",\"\",E35/SUM($E$2:$E$36))","v":""},null,{"$f":"IFERROR(VLOOKUP(ROW()-1,$C$2:$F$36,2,0),\"\")","v":""},{"$f":"IFERROR(VLOOKUP(ROW()-1,$C$2:$F$36,3,0),\"\")","v":""},{"$f":"IFERROR(VLOOKUP(ROW()-1,$C$2:$F$36,4,0),\"\")","v":""}]
[{"$f":"IF(E36=\"\",\"\",RANK(E36,$E$2:$E$36))","v":""},{"$f":"IF(A36=\"\",\"\",A36+ROW()/1000)","v":""},{"$f":"IF(B36=\"\",\"\",RANK(B36,$B$2:$B$36,1))","v":""},{"$f":"IF(Buiséad!D53=\"\",\"\",Buiséad!D53)","v":""},{"$f":"IF(D36=\"\",\"\",ABS(Buiséad!F53))","v":""},{"$f":"IF(E36=\"\",\"\",E36/SUM($E$2:$E$36))","v":""},null,{"$f":"IFERROR(VLOOKUP(ROW()-1,$C$2:$F$36,2,0),\"\")","v":""},{"$f":"IFERROR(VLOOKUP(ROW()-1,$C$2:$F$36,3,0),\"\")","v":""},{"$f":"IFERROR(VLOOKUP(ROW()-1,$C$2:$F$36,4,0),\"\")","v":""}]

{"sheet":"Caiteachais Grúpáilte","index":3,"n_rows":744,"n_cols":7,"rows_kept":744}
["include both cents","concatenate other values","combine the first 2 columns","replace blanks with a unicode character like Z, for alphabetical sorting","Sort C based on D"]
[{"$f":"IF('Taifead Costais'!C6:C750=\"\",\"\",'Taifead Costais'!A6:A750 & \"     \" & TEXT('Taifead Costais'!C6:C750, \".00\") & \"          \")","v":"Catagóir shamplach     1.10          "},{"$f":"IF('Taifead Costais'!C6:C750=\"\",\"\", IF('Taifead Costais'!B6:B750 = \"\", \"\",  'Taifead Costais'!B6:B750 & \"     \") &  IF('Taifead Costais'!D6:D750 = \"\", \"\",  'Taifead Costais'!D6:D750 & \"     \") & IF('Taifead Costais'!E6:E750 = \"\", \"\",  'Taifead Costais'!E6:E750 & \"     \") & IF('Taifead Costais'!F6:F750 = \"\", \"\",  'Taifead Costais'!F6:F750 & \"     \") & IF('Taifead Costais'!G6:G750 = \"\", \"\",  'Taifead Costais'!G6:G750 & \"     \") & IF('Taifead Costais'!H6:H750 = \"\", \"\",  'Taifead Costais'!H6:H750 & \"     \") & IF('Taifead Costais'!I6:I750 = \"\", \"\",  'Taifead Costais'!I6:I750 & \"     \") & IF('Taifead Costais'!J6:J750 = \"\", \"\",  'Taifead Costais'!J6:J750 & \"     \") & IF('Taifead Costais'!K6:K750 = \"\", \"\",  'Taifead Costais'!K6:K750 & \"     \") & IF('Taifead Costais'!L6:L750 = \"\", \"\",  'Taifead Costais'!L6:L750 & \"     \") & IF('Taifead Costais'!M6:M750 = \"\", \"\",  'Taifead Costais'!M6:M750 & \"     \") & IF('Taifead Costais'!N6:N750 = \"\", \"\",  'Taifead Costais'!N6:N750 & \"     \") & IF('Taifead Costais'!O6:O750 = \"\", \"\",  'Taifead Costais'!O6:O750 & \"     \") & IF('Taifead Costais'!P6:P750 = \"\", \"\",  'Taifead Costais'!P6:P750 & \"     \") & IF('Taifead Costais'!Q6:Q750 = \"\", \"\",  'Taifead Costais'!Q6:Q750 & \"     \") & IF('Taifead Costais'!R6:R750 = \"\", \"\",  'Taifead Costais'!R6:R750 & \"     \") & IF('Taifead Costais'!S6:S750 = \"\", \"\",  'Taifead Costais'!S6:S750 & \"     \") & IF('Taifead Costais'!T6:T750 = \"\", \"\",  'Taifead Costais'!T6:T750 & \"     \") & IF('Taifead Costais'!U6:U750 = \"\", \"\",  'Taifead Costais'!U6:U750 & \"     \") & IF('Taifead Costais'!V6:V750 = \"\", \"\",  'Taifead Costais'!V6:V750 & \"     \") & IF('Taifead Costais'!W6:W750 = \"\", \"\",  'Taifead Costais'!W6:W750 & \"     \") & IF('Taifead Costais'!X6:X750 = \"\", \"\",  'Taifead Costais'!X6:X750 & \"     \") & IF('Taifead Costais'!Y6:Y750 = \"\", \"\",  'Taifead Costais'!Y6:Y750 & \"     \") & IF('Taifead Costais'!Z6:Z750 = \"\", \"\",  'Taifead Costais'!Z6:Z750 & \"     \")  )","v":""},{"$f":"A2:A744 & B2:B744","v":"Catagóir shamplach     1.10          "},{"$f":"IF(C2:C744 = \"\",\"𬺓𬺓𬺓\",C2:C744)","v":"Catagóir shamplach     1.10          "},{"$f":"_xlfn._xlws.SORT(C2:D744,2)","v":"Catagóir shamplach     1.10          "},"Catagóir shamplach     1.10          ",{"$f":"E2:E744","v":"Catagóir shamplach     1.10          "}]
["","","","𬺓𬺓𬺓","","𬺓𬺓𬺓",""]
["","","","𬺓𬺓𬺓","","𬺓𬺓𬺓",""]
["","","","𬺓𬺓𬺓","","𬺓𬺓𬺓",""]
["","","","𬺓𬺓𬺓","","𬺓𬺓𬺓",""]
["","","","𬺓𬺓𬺓","","𬺓𬺓𬺓",""]
["","","","𬺓𬺓𬺓","","𬺓𬺓𬺓",""]
["","","","𬺓𬺓𬺓","","𬺓𬺓𬺓",""]
["","","","𬺓𬺓𬺓","","𬺓𬺓𬺓",""]
["","","","𬺓𬺓𬺓","","𬺓𬺓𬺓",""]
["","","","𬺓𬺓𬺓","","𬺓𬺓𬺓",""]
["","","","𬺓𬺓𬺓","","𬺓𬺓𬺓",""]
["","","","𬺓𬺓𬺓","","𬺓𬺓𬺓",""]
["","","","𬺓𬺓𬺓","","𬺓𬺓𬺓",""]
["","","","𬺓𬺓𬺓","","𬺓𬺓𬺓",""]
["","","","𬺓𬺓𬺓","","𬺓𬺓𬺓",""]
["","","","𬺓𬺓𬺓","","𬺓𬺓𬺓",""]
["","","","𬺓𬺓𬺓","","𬺓𬺓𬺓",""]
["","","","𬺓𬺓𬺓","","𬺓𬺓𬺓",""]
["","","","𬺓𬺓𬺓","","𬺓𬺓𬺓",""]
["","","","𬺓𬺓𬺓","","𬺓𬺓𬺓",""]
["","","","𬺓𬺓𬺓","","𬺓𬺓𬺓",""]
["","","","𬺓𬺓𬺓","","𬺓𬺓𬺓",""]
["","","","𬺓𬺓𬺓","","𬺓𬺓𬺓",""]
["","","","𬺓𬺓𬺓","","𬺓𬺓𬺓",""]
["","","","𬺓𬺓𬺓","","𬺓𬺓𬺓",""]
["","","","𬺓𬺓𬺓","","𬺓𬺓𬺓",""]
["","","","𬺓𬺓𬺓","","𬺓𬺓𬺓",""]
["","","","𬺓𬺓𬺓","","𬺓𬺓𬺓",""]
["","","","𬺓𬺓𬺓","","𬺓𬺓𬺓",""]
["","","","𬺓𬺓𬺓","","𬺓𬺓𬺓",""]
["","","","𬺓𬺓𬺓","","𬺓𬺓𬺓",""]
["","","","𬺓𬺓𬺓","","𬺓𬺓𬺓",""]
["","","","𬺓𬺓𬺓","","𬺓𬺓𬺓",""]
["","","","𬺓𬺓𬺓","","𬺓𬺓𬺓",""]
["","","","𬺓𬺓𬺓","","𬺓𬺓𬺓",""]
["","","","𬺓𬺓𬺓","","𬺓𬺓𬺓",""]
["","","","𬺓𬺓𬺓","","𬺓𬺓𬺓",""]
["","","","𬺓𬺓𬺓","","𬺓𬺓𬺓",""]
["","","","𬺓𬺓𬺓","","𬺓𬺓𬺓",""]
["","","","𬺓𬺓𬺓","","𬺓𬺓𬺓",""]
["","","","𬺓𬺓𬺓","","𬺓𬺓𬺓",""]
["","","","𬺓𬺓𬺓","","𬺓𬺓𬺓",""]
["","","","𬺓𬺓𬺓","","𬺓𬺓𬺓",""]
["","","","𬺓𬺓𬺓","","𬺓𬺓𬺓",""]
["","","","𬺓𬺓𬺓","","𬺓𬺓𬺓",""]
["","","","𬺓𬺓𬺓","","𬺓𬺓𬺓",""]
["","","","𬺓𬺓𬺓","","𬺓𬺓𬺓",""]
["","","","𬺓𬺓𬺓","","𬺓𬺓𬺓",""]
["","","","𬺓𬺓𬺓","","𬺓𬺓𬺓",""]
["","","","𬺓𬺓𬺓","","𬺓𬺓𬺓",""]
["","","","𬺓𬺓𬺓","","𬺓𬺓𬺓",""]
["","","","𬺓𬺓𬺓","","𬺓𬺓𬺓",""]
["","","","𬺓𬺓𬺓","","𬺓𬺓𬺓",""]
["","","","𬺓𬺓𬺓","","𬺓𬺓𬺓",""]
["","","","𬺓𬺓𬺓","","𬺓𬺓𬺓",""]
["","","","𬺓𬺓𬺓","","𬺓𬺓𬺓",""]
["","","","𬺓𬺓𬺓","","𬺓𬺓𬺓",""]
["","","","𬺓𬺓𬺓","","𬺓𬺓𬺓",""]
["","","","𬺓𬺓𬺓","","𬺓𬺓𬺓",""]
["","","","𬺓𬺓𬺓","","𬺓𬺓𬺓",""]
["","","","𬺓𬺓𬺓","","𬺓𬺓𬺓",""]
["","","","𬺓𬺓𬺓","","𬺓𬺓𬺓",""]
["","","","𬺓𬺓𬺓","","𬺓𬺓𬺓",""]
["","","","𬺓𬺓𬺓","","𬺓𬺓𬺓",""]
["","","","𬺓𬺓𬺓","","𬺓𬺓𬺓",""]
["","","","𬺓𬺓𬺓","","𬺓𬺓𬺓",""]
["","","","𬺓𬺓𬺓","","𬺓𬺓𬺓",""]
["","","","𬺓𬺓𬺓","","𬺓𬺓𬺓",""]
["","","","𬺓𬺓𬺓","","𬺓𬺓𬺓",""]
["","","","𬺓𬺓𬺓","","𬺓𬺓𬺓",""]
["","","","𬺓𬺓𬺓","","𬺓𬺓𬺓",""]
["","","","𬺓𬺓𬺓","","𬺓𬺓𬺓",""]
["","","","𬺓𬺓𬺓","","𬺓𬺓𬺓",""]
["","","","𬺓𬺓𬺓","","𬺓𬺓𬺓",""]
["","","","𬺓𬺓𬺓","","𬺓𬺓𬺓",""]
["","","","𬺓𬺓𬺓","","𬺓𬺓𬺓",""]
["","","","𬺓𬺓𬺓","","𬺓𬺓𬺓",""]
["","","","𬺓𬺓𬺓","","𬺓𬺓𬺓",""]
["","","","𬺓𬺓𬺓","","𬺓𬺓𬺓",""]
["","","","𬺓𬺓𬺓","","𬺓𬺓𬺓",""]
["","","","𬺓𬺓𬺓","","𬺓𬺓𬺓",""]
["","","","𬺓𬺓𬺓","","𬺓𬺓𬺓",""]
["","","","𬺓𬺓𬺓","","𬺓𬺓𬺓",""]
["","","","𬺓𬺓𬺓","","𬺓𬺓𬺓",""]
["","","","𬺓𬺓𬺓","","𬺓𬺓𬺓",""]
["","","","𬺓𬺓𬺓","","𬺓𬺓𬺓",""]
["","","","𬺓𬺓𬺓","","𬺓𬺓𬺓",""]
["","","","𬺓𬺓𬺓","","𬺓𬺓𬺓",""]
["","","","𬺓𬺓𬺓","","𬺓𬺓𬺓",""]
["","","","𬺓𬺓𬺓","","𬺓𬺓𬺓",""]
["","","","𬺓𬺓𬺓","","𬺓𬺓𬺓",""]
["","","","𬺓𬺓𬺓","","𬺓𬺓𬺓",""]
["","","","𬺓𬺓𬺓","","𬺓𬺓𬺓",""]
["","","","𬺓𬺓𬺓","","𬺓𬺓𬺓",""]
["","","","𬺓𬺓𬺓","","𬺓𬺓𬺓",""]
["","","","𬺓𬺓𬺓","","𬺓𬺓𬺓",""]
["","","","𬺓𬺓𬺓","","𬺓𬺓𬺓",""]
["","","","𬺓𬺓𬺓","","𬺓𬺓𬺓",""]
["","","","𬺓𬺓𬺓","","𬺓𬺓𬺓",""]
["","","","𬺓𬺓𬺓","","𬺓𬺓𬺓",""]
["","","","𬺓𬺓𬺓","","𬺓𬺓𬺓",""]
["","","","𬺓𬺓𬺓","","𬺓𬺓𬺓",""]
["","","","𬺓𬺓𬺓","","𬺓𬺓𬺓",""]
["","","","𬺓𬺓𬺓","","𬺓𬺓𬺓",""]
["","","","𬺓𬺓𬺓","","𬺓𬺓𬺓",""]
["","","","𬺓𬺓𬺓","","𬺓𬺓𬺓",""]
["","","","𬺓𬺓𬺓","","𬺓𬺓𬺓",""]
["","","","𬺓𬺓𬺓","","𬺓𬺓𬺓",""]
["","","","𬺓𬺓𬺓","","𬺓𬺓𬺓",""]
["","","","𬺓𬺓𬺓","","𬺓𬺓𬺓",""]
["","","","𬺓𬺓𬺓","","𬺓𬺓𬺓",""]
["","","","𬺓𬺓𬺓","","𬺓𬺓𬺓",""]
["","","","𬺓𬺓𬺓","","𬺓𬺓𬺓",""]
["","","","𬺓𬺓𬺓","","𬺓𬺓𬺓",""]
["","","","𬺓𬺓𬺓","","𬺓𬺓𬺓",""]
["","","","𬺓𬺓𬺓","","𬺓𬺓𬺓",""]
["","","","𬺓𬺓𬺓","","𬺓𬺓𬺓",""]
["","","","𬺓𬺓𬺓","","𬺓𬺓𬺓",""]
["","","","𬺓𬺓𬺓","","𬺓𬺓𬺓",""]
["","","","𬺓𬺓𬺓","","𬺓𬺓𬺓",""]
["","","","𬺓𬺓𬺓","","𬺓𬺓𬺓",""]
["","","","𬺓𬺓𬺓","","𬺓𬺓𬺓",""]
["","","","𬺓𬺓𬺓","","𬺓𬺓𬺓",""]
["","","","𬺓𬺓𬺓","","𬺓𬺓𬺓",""]
["","","","𬺓𬺓𬺓","","𬺓𬺓𬺓",""]
["","","","𬺓𬺓𬺓","","𬺓𬺓𬺓",""]
["","","","𬺓𬺓𬺓","","𬺓𬺓𬺓",""]
["","","","𬺓𬺓𬺓","","𬺓𬺓𬺓",""]
["","","","𬺓𬺓𬺓","","𬺓𬺓𬺓",""]
["","","","𬺓𬺓𬺓","","𬺓𬺓𬺓",""]
["","","","𬺓𬺓𬺓","","𬺓𬺓𬺓",""]
["","","","𬺓𬺓𬺓","","𬺓𬺓𬺓",""]
["","","","𬺓𬺓𬺓","","𬺓𬺓𬺓",""]
["","","","𬺓𬺓𬺓","","𬺓𬺓𬺓",""]
["","","","𬺓𬺓𬺓","","𬺓𬺓𬺓",""]
["","","","𬺓𬺓𬺓","","𬺓𬺓𬺓",""]
["","","","𬺓𬺓𬺓","","𬺓𬺓𬺓",""]
["","","","𬺓𬺓𬺓","","𬺓𬺓𬺓",""]
["","","","𬺓𬺓𬺓","","𬺓𬺓𬺓",""]
["","","","𬺓𬺓𬺓","","𬺓𬺓𬺓",""]
["","","","𬺓𬺓𬺓","","𬺓𬺓𬺓",""]
["","","","𬺓𬺓𬺓","","𬺓𬺓𬺓",""]
["","","","𬺓𬺓𬺓","","𬺓𬺓𬺓",""]
["","","","𬺓𬺓𬺓","","𬺓𬺓𬺓",""]
["","","","𬺓𬺓𬺓","","𬺓𬺓𬺓",""]
["","","","𬺓𬺓𬺓","","𬺓𬺓𬺓",""]
["","","","𬺓𬺓𬺓","","𬺓𬺓𬺓",""]
["","","","𬺓𬺓𬺓","","𬺓𬺓𬺓",""]
["","","","𬺓𬺓𬺓","","𬺓𬺓𬺓",""]
["","","","𬺓𬺓𬺓","","𬺓𬺓𬺓",""]
["","","","𬺓𬺓𬺓","","𬺓𬺓𬺓",""]
["","","","𬺓𬺓𬺓","","𬺓𬺓𬺓",""]
["","","","𬺓𬺓𬺓","","𬺓𬺓𬺓",""]
["","","","𬺓𬺓𬺓","","𬺓𬺓𬺓",""]
["","","","𬺓𬺓𬺓","","𬺓𬺓𬺓",""]
["","","","𬺓𬺓𬺓","","𬺓𬺓𬺓",""]
["","","","𬺓𬺓𬺓","","𬺓𬺓𬺓",""]
["","","","𬺓𬺓𬺓","","𬺓𬺓𬺓",""]
["","","","𬺓𬺓𬺓","","𬺓𬺓𬺓",""]
["","","","𬺓𬺓𬺓","","𬺓𬺓𬺓",""]
["","","","𬺓𬺓𬺓","","𬺓𬺓𬺓",""]
["","","","𬺓𬺓𬺓","","𬺓𬺓𬺓",""]
["","","","𬺓𬺓𬺓","","𬺓𬺓𬺓",""]
["","","","𬺓𬺓𬺓","","𬺓𬺓𬺓",""]
["","","","𬺓𬺓𬺓","","𬺓𬺓𬺓",""]
["","","","𬺓𬺓𬺓","","𬺓𬺓𬺓",""]
["","","","𬺓𬺓𬺓","","𬺓𬺓𬺓",""]
["","","","𬺓𬺓𬺓","","𬺓𬺓𬺓",""]
["","","","𬺓𬺓𬺓","","𬺓𬺓𬺓",""]
["","","","𬺓𬺓𬺓","","𬺓𬺓𬺓",""]
["","","","𬺓𬺓𬺓","","𬺓𬺓𬺓",""]
["","","","𬺓𬺓𬺓","","𬺓𬺓𬺓",""]
["","","","𬺓𬺓𬺓","","𬺓𬺓𬺓",""]
["","","","𬺓𬺓𬺓","","𬺓𬺓𬺓",""]
["","","","𬺓𬺓𬺓","","𬺓𬺓𬺓",""]
["","","","𬺓𬺓𬺓","","𬺓𬺓𬺓",""]
["","","","𬺓𬺓𬺓","","𬺓𬺓𬺓",""]
["","","","𬺓𬺓𬺓","","𬺓𬺓𬺓",""]
["","","","𬺓𬺓𬺓","","𬺓𬺓𬺓",""]
["","","","𬺓𬺓𬺓","","𬺓𬺓𬺓",""]
["","","","𬺓𬺓𬺓","","𬺓𬺓𬺓",""]
["","","","𬺓𬺓𬺓","","𬺓𬺓𬺓",""]
["","","","𬺓𬺓𬺓","","𬺓𬺓𬺓",""]
["","","","𬺓𬺓𬺓","","𬺓𬺓𬺓",""]
["","","","𬺓𬺓𬺓","","𬺓𬺓𬺓",""]
["","","","𬺓𬺓𬺓","","𬺓𬺓𬺓",""]
["","","","𬺓𬺓𬺓","","𬺓𬺓𬺓",""]
["","","","𬺓𬺓𬺓","","𬺓𬺓𬺓",""]
["","","","𬺓𬺓𬺓","","𬺓𬺓𬺓",""]
["","","","𬺓𬺓𬺓","","𬺓𬺓𬺓",""]
["","","","𬺓𬺓𬺓","","𬺓𬺓𬺓",""]
["","","","𬺓𬺓𬺓","","𬺓𬺓𬺓",""]
["","","","𬺓𬺓𬺓","","𬺓𬺓𬺓",""]
["","","","𬺓𬺓𬺓","","𬺓𬺓𬺓",""]
["","","","𬺓𬺓𬺓","","𬺓𬺓𬺓",""]
["","","","𬺓𬺓𬺓","","𬺓𬺓𬺓",""]
["","","","𬺓𬺓𬺓","","𬺓𬺓𬺓",""]
["","","","𬺓𬺓𬺓","","𬺓𬺓𬺓",""]
["","","","𬺓𬺓𬺓","","𬺓𬺓𬺓",""]
["","","","𬺓𬺓𬺓","","𬺓𬺓𬺓",""]
["","","","𬺓𬺓𬺓","","𬺓𬺓𬺓",""]
["","","","𬺓𬺓𬺓","","𬺓𬺓𬺓",""]
["","","","𬺓𬺓𬺓","","𬺓𬺓𬺓",""]
["","","","𬺓𬺓𬺓","","𬺓𬺓𬺓",""]
["","","","𬺓𬺓𬺓","","𬺓𬺓𬺓",""]
["","","","𬺓𬺓𬺓","","𬺓𬺓𬺓",""]
["","","","𬺓𬺓𬺓","","𬺓𬺓𬺓",""]
["","","","𬺓𬺓𬺓","","𬺓𬺓𬺓",""]
["","","","𬺓𬺓𬺓","","𬺓𬺓𬺓",""]
["","","","𬺓𬺓𬺓","","𬺓𬺓𬺓",""]
["","","","𬺓𬺓𬺓","","𬺓𬺓𬺓",""]
["","","","𬺓𬺓𬺓","","𬺓𬺓𬺓",""]
["","","","𬺓𬺓𬺓","","𬺓𬺓𬺓",""]
["","","","𬺓𬺓𬺓","","𬺓𬺓𬺓",""]
["","","","𬺓𬺓𬺓","","𬺓𬺓𬺓",""]
["","","","𬺓𬺓𬺓","","𬺓𬺓𬺓",""]
["","","","𬺓𬺓𬺓","","𬺓𬺓𬺓",""]
["","","","𬺓𬺓𬺓","","𬺓𬺓𬺓",""]
["","","","𬺓𬺓𬺓","","𬺓𬺓𬺓",""]
["","","","𬺓𬺓𬺓","","𬺓𬺓𬺓",""]
["","","","𬺓𬺓𬺓","","𬺓𬺓𬺓",""]
["","","","𬺓𬺓𬺓","","𬺓𬺓𬺓",""]
["","","","𬺓𬺓𬺓","","𬺓𬺓𬺓",""]
["","","","𬺓𬺓𬺓","","𬺓𬺓𬺓",""]
["","","","𬺓𬺓𬺓","","𬺓𬺓𬺓",""]
["","","","𬺓𬺓𬺓","","𬺓𬺓𬺓",""]
["","","","𬺓𬺓𬺓","","𬺓𬺓𬺓",""]
["","","","𬺓𬺓𬺓","","𬺓𬺓𬺓",""]
["","","","𬺓𬺓𬺓","","𬺓𬺓𬺓",""]
["","","","𬺓𬺓𬺓","","𬺓𬺓𬺓",""]
["","","","𬺓𬺓𬺓","","𬺓𬺓𬺓",""]
["","","","𬺓𬺓𬺓","","𬺓𬺓𬺓",""]
["","","","𬺓𬺓𬺓","","𬺓𬺓𬺓",""]
["","","","𬺓𬺓𬺓","","𬺓𬺓𬺓",""]
["","","","𬺓𬺓𬺓","","𬺓𬺓𬺓",""]
["","","","𬺓𬺓𬺓","","𬺓𬺓𬺓",""]
["","","","𬺓𬺓𬺓","","𬺓𬺓𬺓",""]
["","","","𬺓𬺓𬺓","","𬺓𬺓𬺓",""]
["","","","𬺓𬺓𬺓","","𬺓𬺓𬺓",""]
["","","","𬺓𬺓𬺓","","𬺓𬺓𬺓",""]
["","","","𬺓𬺓𬺓","","𬺓𬺓𬺓",""]
["","","","𬺓𬺓𬺓","","𬺓𬺓𬺓",""]
["","","","𬺓𬺓𬺓","","𬺓𬺓𬺓",""]
["","","","𬺓𬺓𬺓","","𬺓𬺓𬺓",""]
["","","","𬺓𬺓𬺓","","𬺓𬺓𬺓",""]
["","","","𬺓𬺓𬺓","","𬺓𬺓𬺓",""]
["","","","𬺓𬺓𬺓","","𬺓𬺓𬺓",""]
["","","","𬺓𬺓𬺓","","𬺓𬺓𬺓",""]
["","","","𬺓𬺓𬺓","","𬺓𬺓𬺓",""]
["","","","𬺓𬺓𬺓","","𬺓𬺓𬺓",""]
["","","","𬺓𬺓𬺓","","𬺓𬺓𬺓",""]
["","","","𬺓𬺓𬺓","","𬺓𬺓𬺓",""]
["","","","𬺓𬺓𬺓","","𬺓𬺓𬺓",""]
["","","","𬺓𬺓𬺓","","𬺓𬺓𬺓",""]
["","","","𬺓𬺓𬺓","","𬺓𬺓𬺓",""]
["","","","𬺓𬺓𬺓","","𬺓𬺓𬺓",""]
["","","","𬺓𬺓𬺓","","𬺓𬺓𬺓",""]
["","","","𬺓𬺓𬺓","","𬺓𬺓𬺓",""]
["","","","𬺓𬺓𬺓","","𬺓𬺓𬺓",""]
["","","","𬺓𬺓𬺓","","𬺓𬺓𬺓",""]
["","","","𬺓𬺓𬺓","","𬺓𬺓𬺓",""]
["","","","𬺓𬺓𬺓","","𬺓𬺓𬺓",""]
["","","","𬺓𬺓𬺓","","𬺓𬺓𬺓",""]
["","","","𬺓𬺓𬺓","","𬺓𬺓𬺓",""]
["","","","𬺓𬺓𬺓","","𬺓𬺓𬺓",""]
["","","","𬺓𬺓𬺓","","𬺓𬺓𬺓",""]
["","","","𬺓𬺓𬺓","","𬺓𬺓𬺓",""]
["","","","𬺓𬺓𬺓","","𬺓𬺓𬺓",""]
["","","","𬺓𬺓𬺓","","𬺓𬺓𬺓",""]
["","","","𬺓𬺓𬺓","","𬺓𬺓𬺓",""]
["","","","𬺓𬺓𬺓","","𬺓𬺓𬺓",""]
["","","","𬺓𬺓𬺓","","𬺓𬺓𬺓",""]
["","","","𬺓𬺓𬺓","","𬺓𬺓𬺓",""]
["","","","𬺓𬺓𬺓","","𬺓𬺓𬺓",""]
["","","","𬺓𬺓𬺓","","𬺓𬺓𬺓",""]
["","","","𬺓𬺓𬺓","","𬺓𬺓𬺓",""]
["","","","𬺓𬺓𬺓","","𬺓𬺓𬺓",""]
["","","","𬺓𬺓𬺓","","𬺓𬺓𬺓",""]
["","","","𬺓𬺓𬺓","","𬺓𬺓𬺓",""]
["","","","𬺓𬺓𬺓","","𬺓𬺓𬺓",""]
["","","","𬺓𬺓𬺓","","𬺓𬺓𬺓",""]
["","","","𬺓𬺓𬺓","","𬺓𬺓𬺓",""]
["","","","𬺓𬺓𬺓","","𬺓𬺓𬺓",""]
["","","","𬺓𬺓𬺓","","𬺓𬺓𬺓",""]
["","","","𬺓𬺓𬺓","","𬺓𬺓𬺓",""]
["","","","𬺓𬺓𬺓","","𬺓𬺓𬺓",""]
["","","","𬺓𬺓𬺓","","𬺓𬺓𬺓",""]
["","","","𬺓𬺓𬺓","","𬺓𬺓𬺓",""]
["","","","𬺓𬺓𬺓","","𬺓𬺓𬺓",""]
["","","","𬺓𬺓𬺓","","𬺓𬺓𬺓",""]
["","","","𬺓𬺓𬺓","","𬺓𬺓𬺓",""]
["","","","𬺓𬺓𬺓","","𬺓𬺓𬺓",""]
["","","","𬺓𬺓𬺓","","𬺓𬺓𬺓",""]
["","","","𬺓𬺓𬺓","","𬺓𬺓𬺓",""]
["","","","𬺓𬺓𬺓","","𬺓𬺓𬺓",""]
["","","","𬺓𬺓𬺓","","𬺓𬺓𬺓",""]
["","","","𬺓𬺓𬺓","","𬺓𬺓𬺓",""]
["","","","𬺓𬺓𬺓","","𬺓𬺓𬺓",""]
["","","","𬺓𬺓𬺓","","𬺓𬺓𬺓",""]
["","","","𬺓𬺓𬺓","","𬺓𬺓𬺓",""]
["","","","𬺓𬺓𬺓","","𬺓𬺓𬺓",""]
["","","","𬺓𬺓𬺓","","𬺓𬺓𬺓",""]
["","","","𬺓𬺓𬺓","","𬺓𬺓𬺓",""]
["","","","𬺓𬺓𬺓","","𬺓𬺓𬺓",""]
["","","","𬺓𬺓𬺓","","𬺓𬺓𬺓",""]
["","","","𬺓𬺓𬺓","","𬺓𬺓𬺓",""]
["","","","𬺓𬺓𬺓","","𬺓𬺓𬺓",""]
["","","","𬺓𬺓𬺓","","𬺓𬺓𬺓",""]
["","","","𬺓𬺓𬺓","","𬺓𬺓𬺓",""]
["","","","𬺓𬺓𬺓","","𬺓𬺓𬺓",""]
["","","","𬺓𬺓𬺓","","𬺓𬺓𬺓",""]
["","","","𬺓𬺓𬺓","","𬺓𬺓𬺓",""]
["","","","𬺓𬺓𬺓","","𬺓𬺓𬺓",""]
["","","","𬺓𬺓𬺓","","𬺓𬺓𬺓",""]
["","","","𬺓𬺓𬺓","","𬺓𬺓𬺓",""]
["","","","𬺓𬺓𬺓","","𬺓𬺓𬺓",""]
["","","","𬺓𬺓𬺓","","𬺓𬺓𬺓",""]
["","","","𬺓𬺓𬺓","","𬺓𬺓𬺓",""]
["","","","𬺓𬺓𬺓","","𬺓𬺓𬺓",""]
["","","","𬺓𬺓𬺓","","𬺓𬺓𬺓",""]
["","","","𬺓𬺓𬺓","","𬺓𬺓𬺓",""]
["","","","𬺓𬺓𬺓","","𬺓𬺓𬺓",""]
["","","","𬺓𬺓𬺓","","𬺓𬺓𬺓",""]
["","","","𬺓𬺓𬺓","","𬺓𬺓𬺓",""]
["","","","𬺓𬺓𬺓","","𬺓𬺓𬺓",""]
["","","","𬺓𬺓𬺓","","𬺓𬺓𬺓",""]
["","","","𬺓𬺓𬺓","","𬺓𬺓𬺓",""]
["","","","𬺓𬺓𬺓","","𬺓𬺓𬺓",""]
["","","","𬺓𬺓𬺓","","𬺓𬺓𬺓",""]
["","","","𬺓𬺓𬺓","","𬺓𬺓𬺓",""]
["","","","𬺓𬺓𬺓","","𬺓𬺓𬺓",""]
["","","","𬺓𬺓𬺓","","𬺓𬺓𬺓",""]
["","","","𬺓𬺓𬺓","","𬺓𬺓𬺓",""]
["","","","𬺓𬺓𬺓","","𬺓𬺓𬺓",""]
["","","","𬺓𬺓𬺓","","𬺓𬺓𬺓",""]
["","","","𬺓𬺓𬺓","","𬺓𬺓𬺓",""]
["","","","𬺓𬺓𬺓","","𬺓𬺓𬺓",""]
["","","","𬺓𬺓𬺓","","𬺓𬺓𬺓",""]
["","","","𬺓𬺓𬺓","","𬺓𬺓𬺓",""]
["","","","𬺓𬺓𬺓","","𬺓𬺓𬺓",""]
["","","","𬺓𬺓𬺓","","𬺓𬺓𬺓",""]
["","","","𬺓𬺓𬺓","","𬺓𬺓𬺓",""]
["","","","𬺓𬺓𬺓","","𬺓𬺓𬺓",""]
["","","","𬺓𬺓𬺓","","𬺓𬺓𬺓",""]
["","","","𬺓𬺓𬺓","","𬺓𬺓𬺓",""]
["","","","𬺓𬺓𬺓","","𬺓𬺓𬺓",""]
["","","","𬺓𬺓𬺓","","𬺓𬺓𬺓",""]
["","","","𬺓𬺓𬺓","","𬺓𬺓𬺓",""]
["","","","𬺓𬺓𬺓","","𬺓𬺓𬺓",""]
["","","","𬺓𬺓𬺓","","𬺓𬺓𬺓",""]
["","","","𬺓𬺓𬺓","","𬺓𬺓𬺓",""]
["","","","𬺓𬺓𬺓","","𬺓𬺓𬺓",""]
["","","","𬺓𬺓𬺓","","𬺓𬺓𬺓",""]
["","","","𬺓𬺓𬺓","","𬺓𬺓𬺓",""]
["","","","𬺓𬺓𬺓","","𬺓𬺓𬺓",""]
["","","","𬺓𬺓𬺓","","𬺓𬺓𬺓",""]
["","","","𬺓𬺓𬺓","","𬺓𬺓𬺓",""]
["","","","𬺓𬺓𬺓","","𬺓𬺓𬺓",""]
["","","","𬺓𬺓𬺓","","𬺓𬺓𬺓",""]
["","","","𬺓𬺓𬺓","","𬺓𬺓𬺓",""]
["","","","𬺓𬺓𬺓","","𬺓𬺓𬺓",""]
["","","","𬺓𬺓𬺓","","𬺓𬺓𬺓",""]
["","","","𬺓𬺓𬺓","","𬺓𬺓𬺓",""]
["","","","𬺓𬺓𬺓","","𬺓𬺓𬺓",""]
["","","","𬺓𬺓𬺓","","𬺓𬺓𬺓",""]
["","","","𬺓𬺓𬺓","","𬺓𬺓𬺓",""]
["","","","𬺓𬺓𬺓","","𬺓𬺓𬺓",""]
["","","","𬺓𬺓𬺓","","𬺓𬺓𬺓",""]
["","","","𬺓𬺓𬺓","","𬺓𬺓𬺓",""]
["","","","𬺓𬺓𬺓","","𬺓𬺓𬺓",""]
["","","","𬺓𬺓𬺓","","𬺓𬺓𬺓",""]
["","","","𬺓𬺓𬺓","","𬺓𬺓𬺓",""]
["","","","𬺓𬺓𬺓","","𬺓𬺓𬺓",""]
["","","","𬺓𬺓𬺓","","𬺓𬺓𬺓",""]
["","","","𬺓𬺓𬺓","","𬺓𬺓𬺓",""]
["","","","𬺓𬺓𬺓","","𬺓𬺓𬺓",""]
["","","","𬺓𬺓𬺓","","𬺓𬺓𬺓",""]
["","","","𬺓𬺓𬺓","","𬺓𬺓𬺓",""]
["","","","𬺓𬺓𬺓","","𬺓𬺓𬺓",""]
["","","","𬺓𬺓𬺓","","𬺓𬺓𬺓",""]
["","","","𬺓𬺓𬺓","","𬺓𬺓𬺓",""]
["","","","𬺓𬺓𬺓","","𬺓𬺓𬺓",""]
["","","","𬺓𬺓𬺓","","𬺓𬺓𬺓",""]
["","","","𬺓𬺓𬺓","","𬺓𬺓𬺓",""]
["","","","𬺓𬺓𬺓","","𬺓𬺓𬺓",""]
["","","","𬺓𬺓𬺓","","𬺓𬺓𬺓",""]
["","","","𬺓𬺓𬺓","","𬺓𬺓𬺓",""]
["","","","𬺓𬺓𬺓","","𬺓𬺓𬺓",""]
["","","","𬺓𬺓𬺓","","𬺓𬺓𬺓",""]
["","","","𬺓𬺓𬺓","","𬺓𬺓𬺓",""]
["","","","𬺓𬺓𬺓","","𬺓𬺓𬺓",""]
["","","","𬺓𬺓𬺓","","𬺓𬺓𬺓",""]
["","","","𬺓𬺓𬺓","","𬺓𬺓𬺓",""]
["","","","𬺓𬺓𬺓","","𬺓𬺓𬺓",""]
["","","","𬺓𬺓𬺓","","𬺓𬺓𬺓",""]
["","","","𬺓𬺓𬺓","","𬺓𬺓𬺓",""]
["","","","𬺓𬺓𬺓","","𬺓𬺓𬺓",""]
["","","","𬺓𬺓𬺓","","𬺓𬺓𬺓",""]
["","","","𬺓𬺓𬺓","","𬺓𬺓𬺓",""]
["","","","𬺓𬺓𬺓","","𬺓𬺓𬺓",""]
["","","","𬺓𬺓𬺓","","𬺓𬺓𬺓",""]
["","","","𬺓𬺓𬺓","","𬺓𬺓𬺓",""]
["","","","𬺓𬺓𬺓","","𬺓𬺓𬺓",""]
["","","","𬺓𬺓𬺓","","𬺓𬺓𬺓",""]
["","","","𬺓𬺓𬺓","","𬺓𬺓𬺓",""]
["","","","𬺓𬺓𬺓","","𬺓𬺓𬺓",""]
["","","","𬺓𬺓𬺓","","𬺓𬺓𬺓",""]
["","","","𬺓𬺓𬺓","","𬺓𬺓𬺓",""]
["","","","𬺓𬺓𬺓","","𬺓𬺓𬺓",""]
["","","","𬺓𬺓𬺓","","𬺓𬺓𬺓",""]
["","","","𬺓𬺓𬺓","","𬺓𬺓𬺓",""]
["","","","𬺓𬺓𬺓","","𬺓𬺓𬺓",""]
["","","","𬺓𬺓𬺓","","𬺓𬺓𬺓",""]
["","","","𬺓𬺓𬺓","","𬺓𬺓𬺓",""]
["","","","𬺓𬺓𬺓","","𬺓𬺓𬺓",""]
["","","","𬺓𬺓𬺓","","𬺓𬺓𬺓",""]
["","","","𬺓𬺓𬺓","","𬺓𬺓𬺓",""]
["","","","𬺓𬺓𬺓","","𬺓𬺓𬺓",""]
["","","","𬺓𬺓𬺓","","𬺓𬺓𬺓",""]
["","","","𬺓𬺓𬺓","","𬺓𬺓𬺓",""]
["","","","𬺓𬺓𬺓","","𬺓𬺓𬺓",""]
["","","","𬺓𬺓𬺓","","𬺓𬺓𬺓",""]
["","","","𬺓𬺓𬺓","","𬺓𬺓𬺓",""]
["","","","𬺓𬺓𬺓","","𬺓𬺓𬺓",""]
["","","","𬺓𬺓𬺓","","𬺓𬺓𬺓",""]
["","","","𬺓𬺓𬺓","","𬺓𬺓𬺓",""]
["","","","𬺓𬺓𬺓","","𬺓𬺓𬺓",""]
["","","","𬺓𬺓𬺓","","𬺓𬺓𬺓",""]
["","","","𬺓𬺓𬺓","","𬺓𬺓𬺓",""]
["","","","𬺓𬺓𬺓","","𬺓𬺓𬺓",""]
["","","","𬺓𬺓𬺓","","𬺓𬺓𬺓",""]
["","","","𬺓𬺓𬺓","","𬺓𬺓𬺓",""]
["","","","𬺓𬺓𬺓","","𬺓𬺓𬺓",""]
["","","","𬺓𬺓𬺓","","𬺓𬺓𬺓",""]
["","","","𬺓𬺓𬺓","","𬺓𬺓𬺓",""]
["","","","𬺓𬺓𬺓","","𬺓𬺓𬺓",""]
["","","","𬺓𬺓𬺓","","𬺓𬺓𬺓",""]
["","","","𬺓𬺓𬺓","","𬺓𬺓𬺓",""]
["","","","𬺓𬺓𬺓","","𬺓𬺓𬺓",""]
["","","","𬺓𬺓𬺓","","𬺓𬺓𬺓",""]
["","","","𬺓𬺓𬺓","","𬺓𬺓𬺓",""]
["","","","𬺓𬺓𬺓","","𬺓𬺓𬺓",""]
["","","","𬺓𬺓𬺓","","𬺓𬺓𬺓",""]
["","","","𬺓𬺓𬺓","","𬺓𬺓𬺓",""]
["","","","𬺓𬺓𬺓","","𬺓𬺓𬺓",""]
["","","","𬺓𬺓𬺓","","𬺓𬺓𬺓",""]
["","","","𬺓𬺓𬺓","","𬺓𬺓𬺓",""]
["","","","𬺓𬺓𬺓","","𬺓𬺓𬺓",""]
["","","","𬺓𬺓𬺓","","𬺓𬺓𬺓",""]
["","","","𬺓𬺓𬺓","","𬺓𬺓𬺓",""]
["","","","𬺓𬺓𬺓","","𬺓𬺓𬺓",""]
["","","","𬺓𬺓𬺓","","𬺓𬺓𬺓",""]
["","","","𬺓𬺓𬺓","","𬺓𬺓𬺓",""]
["","","","𬺓𬺓𬺓","","𬺓𬺓𬺓",""]
["","","","𬺓𬺓𬺓","","𬺓𬺓𬺓",""]
["","","","𬺓𬺓𬺓","","𬺓𬺓𬺓",""]
["","","","𬺓𬺓𬺓","","𬺓𬺓𬺓",""]
["","","","𬺓𬺓𬺓","","𬺓𬺓𬺓",""]
["","","","𬺓𬺓𬺓","","𬺓𬺓𬺓",""]
["","","","𬺓𬺓𬺓","","𬺓𬺓𬺓",""]
["","","","𬺓𬺓𬺓","","𬺓𬺓𬺓",""]
["","","","𬺓𬺓𬺓","","𬺓𬺓𬺓",""]
["","","","𬺓𬺓𬺓","","𬺓𬺓𬺓",""]
["","","","𬺓𬺓𬺓","","𬺓𬺓𬺓",""]
["","","","𬺓𬺓𬺓","","𬺓𬺓𬺓",""]
["","","","𬺓𬺓𬺓","","𬺓𬺓𬺓",""]
["","","","𬺓𬺓𬺓","","𬺓𬺓𬺓",""]
["","","","𬺓𬺓𬺓","","𬺓𬺓𬺓",""]
["","","","𬺓𬺓𬺓","","𬺓𬺓𬺓",""]
["","","","𬺓𬺓𬺓","","𬺓𬺓𬺓",""]
["","","","𬺓𬺓𬺓","","𬺓𬺓𬺓",""]
["","","","𬺓𬺓𬺓","","𬺓𬺓𬺓",""]
["","","","𬺓𬺓𬺓","","𬺓𬺓𬺓",""]
["","","","𬺓𬺓𬺓","","𬺓𬺓𬺓",""]
["","","","𬺓𬺓𬺓","","𬺓𬺓𬺓",""]
["","","","𬺓𬺓𬺓","","𬺓𬺓𬺓",""]
["","","","𬺓𬺓𬺓","","𬺓𬺓𬺓",""]
["","","","𬺓𬺓𬺓","","𬺓𬺓𬺓",""]
["","","","𬺓𬺓𬺓","","𬺓𬺓𬺓",""]
["","","","𬺓𬺓𬺓","","𬺓𬺓𬺓",""]
["","","","𬺓𬺓𬺓","","𬺓𬺓𬺓",""]
["","","","𬺓𬺓𬺓","","𬺓𬺓𬺓",""]
["","","","𬺓𬺓𬺓","","𬺓𬺓𬺓",""]
["","","","𬺓𬺓𬺓","","𬺓𬺓𬺓",""]
["","","","𬺓𬺓𬺓","","𬺓𬺓𬺓",""]
["","","","𬺓𬺓𬺓","","𬺓𬺓𬺓",""]
["","","","𬺓𬺓𬺓","","𬺓𬺓𬺓",""]
["","","","𬺓𬺓𬺓","","𬺓𬺓𬺓",""]
["","","","𬺓𬺓𬺓","","𬺓𬺓𬺓",""]
["","","","𬺓𬺓𬺓","","𬺓𬺓𬺓",""]
["","","","𬺓𬺓𬺓","","𬺓𬺓𬺓",""]
["","","","𬺓𬺓𬺓","","𬺓𬺓𬺓",""]
["","","","𬺓𬺓𬺓","","𬺓𬺓𬺓",""]
["","","","𬺓𬺓𬺓","","𬺓𬺓𬺓",""]
["","","","𬺓𬺓𬺓","","𬺓𬺓𬺓",""]
["","","","𬺓𬺓𬺓","","𬺓𬺓𬺓",""]
["","","","𬺓𬺓𬺓","","𬺓𬺓𬺓",""]
["","","","𬺓𬺓𬺓","","𬺓𬺓𬺓",""]
["","","","𬺓𬺓𬺓","","𬺓𬺓𬺓",""]
["","","","𬺓𬺓𬺓","","𬺓𬺓𬺓",""]
["","","","𬺓𬺓𬺓","","𬺓𬺓𬺓",""]
["","","","𬺓𬺓𬺓","","𬺓𬺓𬺓",""]
["","","","𬺓𬺓𬺓","","𬺓𬺓𬺓",""]
["","","","𬺓𬺓𬺓","","𬺓𬺓𬺓",""]
["","","","𬺓𬺓𬺓","","𬺓𬺓𬺓",""]
["","","","𬺓𬺓𬺓","","𬺓𬺓𬺓",""]
["","","","𬺓𬺓𬺓","","𬺓𬺓𬺓",""]
["","","","𬺓𬺓𬺓","","𬺓𬺓𬺓",""]
["","","","𬺓𬺓𬺓","","𬺓𬺓𬺓",""]
["","","","𬺓𬺓𬺓","","𬺓𬺓𬺓",""]
["","","","𬺓𬺓𬺓","","𬺓𬺓𬺓",""]
["","","","𬺓𬺓𬺓","","𬺓𬺓𬺓",""]
["","","","𬺓𬺓𬺓","","𬺓𬺓𬺓",""]
["","","","𬺓𬺓𬺓","","𬺓𬺓𬺓",""]
["","","","𬺓𬺓𬺓","","𬺓𬺓𬺓",""]
["","","","𬺓𬺓𬺓","","𬺓𬺓𬺓",""]
["","","","𬺓𬺓𬺓","","𬺓𬺓𬺓",""]
["","","","𬺓𬺓𬺓","","𬺓𬺓𬺓",""]
["","","","𬺓𬺓𬺓","","𬺓𬺓𬺓",""]
["","","","𬺓𬺓𬺓","","𬺓𬺓𬺓",""]
["","","","𬺓𬺓𬺓","","𬺓𬺓𬺓",""]
["","","","𬺓𬺓𬺓","","𬺓𬺓𬺓",""]
["","","","𬺓𬺓𬺓","","𬺓𬺓𬺓",""]
["","","","𬺓𬺓𬺓","","𬺓𬺓𬺓",""]
["","","","𬺓𬺓𬺓","","𬺓𬺓𬺓",""]
["","","","𬺓𬺓𬺓","","𬺓𬺓𬺓",""]
["","","","𬺓𬺓𬺓","","𬺓𬺓𬺓",""]
["","","","𬺓𬺓𬺓","","𬺓𬺓𬺓",""]
["","","","𬺓𬺓𬺓","","𬺓𬺓𬺓",""]
["","","","𬺓𬺓𬺓","","𬺓𬺓𬺓",""]
["","","","𬺓𬺓𬺓","","𬺓𬺓𬺓",""]
["","","","𬺓𬺓𬺓","","𬺓𬺓𬺓",""]
["","","","𬺓𬺓𬺓","","𬺓𬺓𬺓",""]
["","","","𬺓𬺓𬺓","","𬺓𬺓𬺓",""]
["","","","𬺓𬺓𬺓","","𬺓𬺓𬺓",""]
["","","","𬺓𬺓𬺓","","𬺓𬺓𬺓",""]
["","","","𬺓𬺓𬺓","","𬺓𬺓𬺓",""]
["","","","𬺓𬺓𬺓","","𬺓𬺓𬺓",""]
["","","","𬺓𬺓𬺓","","𬺓𬺓𬺓",""]
["","","","𬺓𬺓𬺓","","𬺓𬺓𬺓",""]
["","","","𬺓𬺓𬺓","","𬺓𬺓𬺓",""]
["","","","𬺓𬺓𬺓","","𬺓𬺓𬺓",""]
["","","","𬺓𬺓𬺓","","𬺓𬺓𬺓",""]
["","","","𬺓𬺓𬺓","","𬺓𬺓𬺓",""]
["","","","𬺓𬺓𬺓","","𬺓𬺓𬺓",""]
["","","","𬺓𬺓𬺓","","𬺓𬺓𬺓",""]
["","","","𬺓𬺓𬺓","","𬺓𬺓𬺓",""]
["","","","𬺓𬺓𬺓","","𬺓𬺓𬺓",""]
["","","","𬺓𬺓𬺓","","𬺓𬺓𬺓",""]
["","","","𬺓𬺓𬺓","","𬺓𬺓𬺓",""]
["","","","𬺓𬺓𬺓","","𬺓𬺓𬺓",""]
["","","","𬺓𬺓𬺓","","𬺓𬺓𬺓",""]
["","","","𬺓𬺓𬺓","","𬺓𬺓𬺓",""]
["","","","𬺓𬺓𬺓","","𬺓𬺓𬺓",""]
["","","","𬺓𬺓𬺓","","𬺓𬺓𬺓",""]
["","","","𬺓𬺓𬺓","","𬺓𬺓𬺓",""]
["","","","𬺓𬺓𬺓","","𬺓𬺓𬺓",""]
["","","","𬺓𬺓𬺓","","𬺓𬺓𬺓",""]
["","","","𬺓𬺓𬺓","","𬺓𬺓𬺓",""]
["","","","𬺓𬺓𬺓","","𬺓𬺓𬺓",""]
["","","","𬺓𬺓𬺓","","𬺓𬺓𬺓",""]
["","","","𬺓𬺓𬺓","","𬺓𬺓𬺓",""]
["","","","𬺓𬺓𬺓","","𬺓𬺓𬺓",""]
["","","","𬺓𬺓𬺓","","𬺓𬺓𬺓",""]
["","","","𬺓𬺓𬺓","","𬺓𬺓𬺓",""]
["","","","𬺓𬺓𬺓","","𬺓𬺓𬺓",""]
["","","","𬺓𬺓𬺓","","𬺓𬺓𬺓",""]
["","","","𬺓𬺓𬺓","","𬺓𬺓𬺓",""]
["","","","𬺓𬺓𬺓","","𬺓𬺓𬺓",""]
["","","","𬺓𬺓𬺓","","𬺓𬺓𬺓",""]
["","","","𬺓𬺓𬺓","","𬺓𬺓𬺓",""]
["","","","𬺓𬺓𬺓","","𬺓𬺓𬺓",""]
["","","","𬺓𬺓𬺓","","𬺓𬺓𬺓",""]
["","","","𬺓𬺓𬺓","","𬺓𬺓𬺓",""]
["","","","𬺓𬺓𬺓","","𬺓𬺓𬺓",""]
["","","","𬺓𬺓𬺓","","𬺓𬺓𬺓",""]
["","","","𬺓𬺓𬺓","","𬺓𬺓𬺓",""]
["","","","𬺓𬺓𬺓","","𬺓𬺓𬺓",""]
["","","","𬺓𬺓𬺓","","𬺓𬺓𬺓",""]
["","","","𬺓𬺓𬺓","","𬺓𬺓𬺓",""]
["","","","𬺓𬺓𬺓","","𬺓𬺓𬺓",""]
["","","","𬺓𬺓𬺓","","𬺓𬺓𬺓",""]
["","","","𬺓𬺓𬺓","","𬺓𬺓𬺓",""]
["","","","𬺓𬺓𬺓","","𬺓𬺓𬺓",""]
["","","","𬺓𬺓𬺓","","𬺓𬺓𬺓",""]
["","","","𬺓𬺓𬺓","","𬺓𬺓𬺓",""]
["","","","𬺓𬺓𬺓","","𬺓𬺓𬺓",""]
["","","","𬺓𬺓𬺓","","𬺓𬺓𬺓",""]
["","","","𬺓𬺓𬺓","","𬺓𬺓𬺓",""]
["","","","𬺓𬺓𬺓","","𬺓𬺓𬺓",""]
["","","","𬺓𬺓𬺓","","𬺓𬺓𬺓",""]
["","","","𬺓𬺓𬺓","","𬺓𬺓𬺓",""]
["","","","𬺓𬺓𬺓","","𬺓𬺓𬺓",""]
["","","","𬺓𬺓𬺓","","𬺓𬺓𬺓",""]
["","","","𬺓𬺓𬺓","","𬺓𬺓𬺓",""]
["","","","𬺓𬺓𬺓","","𬺓𬺓𬺓",""]
["","","","𬺓𬺓𬺓","","𬺓𬺓𬺓",""]
["","","","𬺓𬺓𬺓","","𬺓𬺓𬺓",""]
["","","","𬺓𬺓𬺓","","𬺓𬺓𬺓",""]
["","","","𬺓𬺓𬺓","","𬺓𬺓𬺓",""]
["","","","𬺓𬺓𬺓","","𬺓𬺓𬺓",""]
["","","","𬺓𬺓𬺓","","𬺓𬺓𬺓",""]
["","","","𬺓𬺓𬺓","","𬺓𬺓𬺓",""]
["","","","𬺓𬺓𬺓","","𬺓𬺓𬺓",""]
["","","","𬺓𬺓𬺓","","𬺓𬺓𬺓",""]
["","","","𬺓𬺓𬺓","","𬺓𬺓𬺓",""]
["","","","𬺓𬺓𬺓","","𬺓𬺓𬺓",""]
["","","","𬺓𬺓𬺓","","𬺓𬺓𬺓",""]
["","","","𬺓𬺓𬺓","","𬺓𬺓𬺓",""]
["","","","𬺓𬺓𬺓","","𬺓𬺓𬺓",""]
["","","","𬺓𬺓𬺓","","𬺓𬺓𬺓",""]
["","","","𬺓𬺓𬺓","","𬺓𬺓𬺓",""]
["","","","𬺓𬺓𬺓","","𬺓𬺓𬺓",""]
["","","","𬺓𬺓𬺓","","𬺓𬺓𬺓",""]
["","","","𬺓𬺓𬺓","","𬺓𬺓𬺓",""]
["","","","𬺓𬺓𬺓","","𬺓𬺓𬺓",""]
["","","","𬺓𬺓𬺓","","𬺓𬺓𬺓",""]
["","","","𬺓𬺓𬺓","","𬺓𬺓𬺓",""]
["","","","𬺓𬺓𬺓","","𬺓𬺓𬺓",""]
["","","","𬺓𬺓𬺓","","𬺓𬺓𬺓",""]
["","","","𬺓𬺓𬺓","","𬺓𬺓𬺓",""]
["","","","𬺓𬺓𬺓","","𬺓𬺓𬺓",""]
["","","","𬺓𬺓𬺓","","𬺓𬺓𬺓",""]
["","","","𬺓𬺓𬺓","","𬺓𬺓𬺓",""]
["","","","𬺓𬺓𬺓","","𬺓𬺓𬺓",""]
["","","","𬺓𬺓𬺓","","𬺓𬺓𬺓",""]
["","","","𬺓𬺓𬺓","","𬺓𬺓𬺓",""]
["","","","𬺓𬺓𬺓","","𬺓𬺓𬺓",""]
["","","","𬺓𬺓𬺓","","𬺓𬺓𬺓",""]
["","","","𬺓𬺓𬺓","","𬺓𬺓𬺓",""]
["","","","𬺓𬺓𬺓","","𬺓𬺓𬺓",""]
["","","","𬺓𬺓𬺓","","𬺓𬺓𬺓",""]
["","","","𬺓𬺓𬺓","","𬺓𬺓𬺓",""]
["","","","𬺓𬺓𬺓","","𬺓𬺓𬺓",""]
["","","","𬺓𬺓𬺓","","𬺓𬺓𬺓",""]
["","","","𬺓𬺓𬺓","","𬺓𬺓𬺓",""]
["","","","𬺓𬺓𬺓","","𬺓𬺓𬺓",""]
["","","","𬺓𬺓𬺓","","𬺓𬺓𬺓",""]
["","","","𬺓𬺓𬺓","","𬺓𬺓𬺓",""]
["","","","𬺓𬺓𬺓","","𬺓𬺓𬺓",""]
["","","","𬺓𬺓𬺓","","𬺓𬺓𬺓",""]
["","","","𬺓𬺓𬺓","","𬺓𬺓𬺓",""]
["","","","𬺓𬺓𬺓","","𬺓𬺓𬺓",""]
["","","","𬺓𬺓𬺓","","𬺓𬺓𬺓",""]
["","","","𬺓𬺓𬺓","","𬺓𬺓𬺓",""]
["","","","𬺓𬺓𬺓","","𬺓𬺓𬺓",""]
["","","","𬺓𬺓𬺓","","𬺓𬺓𬺓",""]
["","","","𬺓𬺓𬺓","","𬺓𬺓𬺓",""]
["","","","𬺓𬺓𬺓","","𬺓𬺓𬺓",""]
["","","","𬺓𬺓𬺓","","𬺓𬺓𬺓",""]
["","","","𬺓𬺓𬺓","","𬺓𬺓𬺓",""]
["","","","𬺓𬺓𬺓","","𬺓𬺓𬺓",""]
["","","","𬺓𬺓𬺓","","𬺓𬺓𬺓",""]
["","","","𬺓𬺓𬺓","","𬺓𬺓𬺓",""]
["","","","𬺓𬺓𬺓","","𬺓𬺓𬺓",""]
["","","","𬺓𬺓𬺓","","𬺓𬺓𬺓",""]
["","","","𬺓𬺓𬺓","","𬺓𬺓𬺓",""]
["","","","𬺓𬺓𬺓","","𬺓𬺓𬺓",""]
["","","","𬺓𬺓𬺓","","𬺓𬺓𬺓",""]
["","","","𬺓𬺓𬺓","","𬺓𬺓𬺓",""]
["","","","𬺓𬺓𬺓","","𬺓𬺓𬺓",""]
["","","","𬺓𬺓𬺓","","𬺓𬺓𬺓",""]
["","","","𬺓𬺓𬺓","","𬺓𬺓𬺓",""]
["","","","𬺓𬺓𬺓","","𬺓𬺓𬺓",""]
["","","","𬺓𬺓𬺓","","𬺓𬺓𬺓",""]
["","","","𬺓𬺓𬺓","","𬺓𬺓𬺓",""]
["","","","𬺓𬺓𬺓","","𬺓𬺓𬺓",""]
["","","","𬺓𬺓𬺓","","𬺓𬺓𬺓",""]
["","","","𬺓𬺓𬺓","","𬺓𬺓𬺓",""]
["","","","𬺓𬺓𬺓","","𬺓𬺓𬺓",""]
["","","","𬺓𬺓𬺓","","𬺓𬺓𬺓",""]
["","","","𬺓𬺓𬺓","","𬺓𬺓𬺓",""]
["","","","𬺓𬺓𬺓","","𬺓𬺓𬺓",""]
["","","","𬺓𬺓𬺓","","𬺓𬺓𬺓",""]
["","","","𬺓𬺓𬺓","","𬺓𬺓𬺓",""]
["","","","𬺓𬺓𬺓","","𬺓𬺓𬺓",""]
["","","","𬺓𬺓𬺓","","𬺓𬺓𬺓",""]
["","","","𬺓𬺓𬺓","","𬺓𬺓𬺓",""]
["","","","𬺓𬺓𬺓","","𬺓𬺓𬺓",""]
["","","","𬺓𬺓𬺓","","𬺓𬺓𬺓",""]
["","","","𬺓𬺓𬺓","","𬺓𬺓𬺓",""]
["","","","𬺓𬺓𬺓","","𬺓𬺓𬺓",""]
["","","","𬺓𬺓𬺓","","𬺓𬺓𬺓",""]
["","","","𬺓𬺓𬺓","","𬺓𬺓𬺓",""]
["","","","𬺓𬺓𬺓","","𬺓𬺓𬺓",""]
["","","","𬺓𬺓𬺓","","𬺓𬺓𬺓",""]
["","","","𬺓𬺓𬺓","","𬺓𬺓𬺓",""]
["","","","𬺓𬺓𬺓","","𬺓𬺓𬺓",""]
["","","","𬺓𬺓𬺓","","𬺓𬺓𬺓",""]
["","","","𬺓𬺓𬺓","","𬺓𬺓𬺓",""]
["","","","𬺓𬺓𬺓","","𬺓𬺓𬺓",""]
["","","","𬺓𬺓𬺓","","𬺓𬺓𬺓",""]
["","","","𬺓𬺓𬺓","","𬺓𬺓𬺓",""]
["","","","𬺓𬺓𬺓","","𬺓𬺓𬺓",""]
["","","","𬺓𬺓𬺓","","𬺓𬺓𬺓",""]
["","","","𬺓𬺓𬺓","","𬺓𬺓𬺓",""]
["","","","𬺓𬺓𬺓","","𬺓𬺓𬺓",""]
["","","","𬺓𬺓𬺓","","𬺓𬺓𬺓",""]
["","","","𬺓𬺓𬺓","","𬺓𬺓𬺓",""]
["","","","𬺓𬺓𬺓","","𬺓𬺓𬺓",""]
["","","","𬺓𬺓𬺓","","𬺓𬺓𬺓",""]
["","","","𬺓𬺓𬺓","","𬺓𬺓𬺓",""]
["","","","𬺓𬺓𬺓","","𬺓𬺓𬺓",""]
["","","","𬺓𬺓𬺓","","𬺓𬺓𬺓",""]
["","","","𬺓𬺓𬺓","","𬺓𬺓𬺓",""]
["","","","𬺓𬺓𬺓","","𬺓𬺓𬺓",""]
["","","","𬺓𬺓𬺓","","𬺓𬺓𬺓",""]
["","","","𬺓𬺓𬺓","","𬺓𬺓𬺓",""]
["","","","𬺓𬺓𬺓","","𬺓𬺓𬺓",""]
["","","","𬺓𬺓𬺓","","𬺓𬺓𬺓",""]
["","","","𬺓𬺓𬺓","","𬺓𬺓𬺓",""]
["","","","𬺓𬺓𬺓","","𬺓𬺓𬺓",""]
["","","","𬺓𬺓𬺓","","𬺓𬺓𬺓",""]
["","","","𬺓𬺓𬺓","","𬺓𬺓𬺓",""]
["","","","𬺓𬺓𬺓","","𬺓𬺓𬺓",""]
["","","","𬺓𬺓𬺓","","𬺓𬺓𬺓",""]
["","","","𬺓𬺓𬺓","","𬺓𬺓𬺓",""]
["","","","𬺓𬺓𬺓","","𬺓𬺓𬺓",""]
["","","","𬺓𬺓𬺓","","𬺓𬺓𬺓",""]
["","","","𬺓𬺓𬺓","","𬺓𬺓𬺓",""]
["","","","𬺓𬺓𬺓","","𬺓𬺓𬺓",""]
["","","","𬺓𬺓𬺓","","𬺓𬺓𬺓",""]
["","","","𬺓𬺓𬺓","","𬺓𬺓𬺓",""]
["","","","𬺓𬺓𬺓","","𬺓𬺓𬺓",""]
["","","","𬺓𬺓𬺓","","𬺓𬺓𬺓",""]
["","","","𬺓𬺓𬺓","","𬺓𬺓𬺓",""]
["","","","𬺓𬺓𬺓","","𬺓𬺓𬺓",""]
["","","","𬺓𬺓𬺓","","𬺓𬺓𬺓",""]
["","","","𬺓𬺓𬺓","","𬺓𬺓𬺓",""]
["","","","𬺓𬺓𬺓","","𬺓𬺓𬺓",""]
["","","","𬺓𬺓𬺓","","𬺓𬺓𬺓",""]
["","","","𬺓𬺓𬺓","","𬺓𬺓𬺓",""]
["","","","𬺓𬺓𬺓","","𬺓𬺓𬺓",""]
["","","","𬺓𬺓𬺓","","𬺓𬺓𬺓",""]
["","","","𬺓𬺓𬺓","","𬺓𬺓𬺓",""]
["","","","𬺓𬺓𬺓","","𬺓𬺓𬺓",""]
["","","","𬺓𬺓𬺓","","𬺓𬺓𬺓",""]
["","","","𬺓𬺓𬺓","","𬺓𬺓𬺓",""]
["","","","𬺓𬺓𬺓","","𬺓𬺓𬺓",""]
["","","","𬺓𬺓𬺓","","𬺓𬺓𬺓",""]
["","","","𬺓𬺓𬺓","","𬺓𬺓𬺓",""]
["","","","𬺓𬺓𬺓","","𬺓𬺓𬺓",""]

{"sheet":"Nótaí","index":4,"n_rows":1,"n_cols":7,"rows_kept":1}
["Nótaí",{"$nulls":5},"Leagan 2.9"]

{"sheet":"formula","index":5,"n_rows":4,"n_cols":26,"rows_kept":4,"hidden":true}
["Because TEXTJOIN doesn't seem to work in an array formula, I am creating the equivalent function here for the \"expenses grouped\" tab."]
[{"$nulls":3},"D","E","F","G","H","I","J","K","L","M","N","O","P","Q","R","S","T","U","V","W","X","Y","Z"]
[null,"IF($'Record Expenses'.B5:B850 = \"\", \"\",  $'Record Expenses'.B5:B850 & \"     \") &",null,{"$f":"SUBSTITUTE($B3,\"B\",D2)","v":"IF($'Record Expenses'.D5:D850 = \"\", \"\",  $'Record Expenses'.D5:D850 & \"     \") &"},{"$f":"SUBSTITUTE($B3,\"B\",E2)","v":"IF($'Record Expenses'.E5:E850 = \"\", \"\",  $'Record Expenses'.E5:E850 & \"     \") &"},{"$f":"SUBSTITUTE($B3,\"B\",F2)","v":"IF($'Record Expenses'.F5:F850 = \"\", \"\",  $'Record Expenses'.F5:F850 & \"     \") &"},{"$f":"SUBSTITUTE($B3,\"B\",G2)","v":"IF($'Record Expenses'.G5:G850 = \"\", \"\",  $'Record Expenses'.G5:G850 & \"     \") &"},{"$f":"SUBSTITUTE($B3,\"B\",H2)","v":"IF($'Record Expenses'.H5:H850 = \"\", \"\",  $'Record Expenses'.H5:H850 & \"     \") &"},{"$f":"SUBSTITUTE($B3,\"B\",I2)","v":"IF($'Record Expenses'.I5:I850 = \"\", \"\",  $'Record Expenses'.I5:I850 & \"     \") &"},{"$f":"SUBSTITUTE($B3,\"B\",J2)","v":"IF($'Record Expenses'.J5:J850 = \"\", \"\",  $'Record Expenses'.J5:J850 & \"     \") &"},{"$f":"SUBSTITUTE($B3,\"B\",K2)","v":"IF($'Record Expenses'.K5:K850 = \"\", \"\",  $'Record Expenses'.K5:K850 & \"     \") &"},{"$f":"SUBSTITUTE($B3,\"B\",L2)","v":"IF($'Record Expenses'.L5:L850 = \"\", \"\",  $'Record Expenses'.L5:L850 & \"     \") &"},{"$f":"SUBSTITUTE($B3,\"B\",M2)","v":"IF($'Record Expenses'.M5:M850 = \"\", \"\",  $'Record Expenses'.M5:M850 & \"     \") &"},{"$f":"SUBSTITUTE($B3,\"B\",N2)","v":"IF($'Record Expenses'.N5:N850 = \"\", \"\",  $'Record Expenses'.N5:N850 & \"     \") &"},{"$f":"SUBSTITUTE($B3,\"B\",O2)","v":"IF($'Record Expenses'.O5:O850 = \"\", \"\",  $'Record Expenses'.O5:O850 & \"     \") &"},{"$f":"SUBSTITUTE($B3,\"B\",P2)","v":"IF($'Record Expenses'.P5:P850 = \"\", \"\",  $'Record Expenses'.P5:P850 & \"     \") &"},{"$f":"SUBSTITUTE($B3,\"B\",Q2)","v":"IF($'Record Expenses'.Q5:Q850 = \"\", \"\",  $'Record Expenses'.Q5:Q850 & \"     \") &"},{"$f":"SUBSTITUTE($B3,\"B\",R2)","v":"IF($'Record Expenses'.R5:R850 = \"\", \"\",  $'Record Expenses'.R5:R850 & \"     \") &"},{"$f":"SUBSTITUTE($B3,\"B\",S2)","v":"IF($'Record Expenses'.S5:S850 = \"\", \"\",  $'Record Expenses'.S5:S850 & \"     \") &"},{"$f":"SUBSTITUTE($B3,\"B\",T2)","v":"IF($'Record Expenses'.T5:T850 = \"\", \"\",  $'Record Expenses'.T5:T850 & \"     \") &"},{"$f":"SUBSTITUTE($B3,\"B\",U2)","v":"IF($'Record Expenses'.U5:U850 = \"\", \"\",  $'Record Expenses'.U5:U850 & \"     \") &"},{"$f":"SUBSTITUTE($B3,\"B\",V2)","v":"IF($'Record Expenses'.V5:V850 = \"\", \"\",  $'Record Expenses'.V5:V850 & \"     \") &"},{"$f":"SUBSTITUTE($B3,\"B\",W2)","v":"IF($'Record Expenses'.W5:W850 = \"\", \"\",  $'Record Expenses'.W5:W850 & \"     \") &"},{"$f":"SUBSTITUTE($B3,\"B\",X2)","v":"IF($'Record Expenses'.X5:X850 = \"\", \"\",  $'Record Expenses'.X5:X850 & \"     \") &"},{"$f":"SUBSTITUTE($B3,\"B\",Y2)","v":"IF($'Record Expenses'.Y5:Y850 = \"\", \"\",  $'Record Expenses'.Y5:Y850 & \"     \") &"},{"$f":"SUBSTITUTE($B3,\"B\",Z2)","v":"IF($'Record Expenses'.Z5:Z850 = \"\", \"\",  $'Record Expenses'.Z5:Z850 & \"     \") &"}]
["actual formula: ","'=IF($'Record Expenses'.C5:C850=\"\",\"\", IF($'Record Expenses'.B5:B850 = \"\", \"\",  $'Record Expenses'.B5:B850 & \"     \") &  IF($'Record Expenses'.D5:D850 = \"\", \"\",  $'Record Expenses'.D5:D850 & \"     \") & IF($'Record Expenses'.E5:E850 = \"\", \"\",  $'Record Expenses'.E5:E850 & \"     \") & IF($'Record Expenses'.F5:F850 = \"\", \"\",  $'Record Expenses'.F5:F850 & \"     \") & IF($'Record Expenses'.G5:G850 = \"\", \"\",  $'Record Expenses'.G5:G850 & \"     \") & IF($'Record Expenses'.H5:H850 = \"\", \"\",  $'Record Expenses'.H5:H850 & \"     \") & IF($'Record Expenses'.I5:I850 = \"\", \"\",  $'Record Expenses'.I5:I850 & \"     \") & IF($'Record Expenses'.J5:J850 = \"\", \"\",  $'Record Expenses'.J5:J850 & \"     \") & IF($'Record Expenses'.K5:K850 = \"\", \"\",  $'Record Expenses'.K5:K850 & \"     \") & IF($'Record Expenses'.L5:L850 = \"\", \"\",  $'Record Expenses'.L5:L850 & \"     \") & IF($'Record Expenses'.M5:M850 = \"\", \"\",  $'Record Expenses'.M5:M850 & \"     \") & IF($'Record Expenses'.N5:N850 = \"\", \"\",  $'Record Expenses'.N5:N850 & \"     \") & IF($'Record Expenses'.O5:O850 = \"\", \"\",  $'Record Expenses'.O5:O850 & \"     \") & IF($'Record Expenses'.P5:P850 = \"\", \"\",  $'Record Expenses'.P5:P850 & \"     \") & IF($'Record Expenses'.Q5:Q850 = \"\", \"\",  $'Record Expenses'.Q5:Q850 & \"     \") & IF($'Record Expenses'.R5:R850 = \"\", \"\",  $'Record Expenses'.R5:R850 & \"     \") & IF($'Record Expenses'.S5:S850 = \"\", \"\",  $'Record Expenses'.S5:S850 & \"     \") & IF($'Record Expenses'.T5:T850 = \"\", \"\",  $'Record Expenses'.T5:T850 & \"     \") & IF($'Record Expenses'.U5:U850 = \"\", \"\",  $'Record Expenses'.U5:U850 & \"     \") & IF($'Record Expenses'.V5:V850 = \"\", \"\",  $'Record Expenses'.V5:V850 & \"     \") & IF($'Record Expenses'.W5:W850 = \"\", \"\",  $'Record Expenses'.W5:W850 & \"     \") & IF($'Record Expenses'.X5:X850 = \"\", \"\",  $'Record Expenses'.X5:X850 & \"     \") & IF($'Record Expenses'.Y5:Y850 = \"\", \"\",  $'Record Expenses'.Y5:Y850 & \"     \") & IF($'Record Expenses'.Z5:Z850 = \"\", \"\",  $'Record Expenses'.Z5:Z850 & \"     \")  )"]