{"text_format":"3","workbook":"xlsx","n_sheets":6,"sheets":["Pressupost","Registrar despeses","Gràfic circular","Despeses agrupades","Notes","formula"],"not_rendered":{"charts":2,"defined_names":1,"comments":1},"read":"whole","date_system":"1900"}

{"sheet":"Pressupost","index":0,"n_rows":54,"n_cols":7,"rows_kept":54,"merged":[[0,3,1,3],[1,4,1,5]]}
[{"$nulls":3},"Pressupost mensual per a "]
[{"$nulls":4},"mes any"]
[]
[{"$nulls":3},"Fons disponibles"]
[{"$nulls":3},"descripció",{"v":125,"d":"125.00"},null,"Omple els camps grocs.  "]
[{"$nulls":6},"Vegeu la pestanya següent per a les despeses.  "]
[]
[]
[]
[]
[{"$nulls":3},"Total disponible:",{"$f":"SUM(E5:E10)","v":{"v":125,"d":"125.00"}}]
[]
[]
[{"$nulls":4},"Total disponible","Total gastat","Total restant"]
[{"$nulls":4},{"$f":"E11","v":{"v":125,"d":"125.00"}},{"$f":"SUM(F18:F52)","v":{"v":1.1,"d":"1.10"}},{"$f":"E15-ABS(F15)","v":{"v":123.9,"d":"123.90"}}]
[]
[{"$nulls":3},"Categoria","Import assignat","Import gastat","Import restant"]
[null,null,1,"categoria d'exemple",{"v":2,"d":"2.00"},{"$f":"IF(D18=\"\",\"\",SUMIF('Registrar despeses'!A:A,D18,'Registrar despeses'!C:C))","v":{"v":1.1,"d":"1.10"}},{"$f":"IF(D18=\"\",\"\",E18-ABS(F18))","v":{"v":0.8999999999999999,"d":"0.90"}}]
[null,null,2,"hipoteca",null,{"$f":"IF(D19=\"\",\"\",SUMIF('Registrar despeses'!A:A,D19,'Registrar despeses'!C:C))","v":{"v":0,"d":"0.00"}},{"v":0,"d":"0.00"}]
[null,null,3,"gasolina",null,{"$f":"IF(D20=\"\",\"\",SUMIF('Registrar despeses'!A:A,D20,'Registrar despeses'!C:C))","v":{"v":0,"d":"0.00"}},{"v":0,"d":"0.00"}]
[null,null,4,"queviures",null,{"$f":"IF(D21=\"\",\"\",SUMIF('Registrar despeses'!A:A,D21,'Registrar despeses'!C:C))","v":{"v":0,"d":"0.00"}},{"v":0,"d":"0.00"}]
[null,null,5,"restaurants",null,{"$f":"IF(D22=\"\",\"\",SUMIF('Registrar despeses'!A:A,D22,'Registrar despeses'!C:C))","v":{"v":0,"d":"0.00"}},{"v":0,"d":"0.00"}]
[null,null,6,null,null,{"$f":"IF(D23=\"\",\"\",SUMIF('Registrar despeses'!A:A,D23,'Registrar despeses'!C:C))","v":""},""]
[null,null,7,null,null,{"$f":"IF(D24=\"\",\"\",SUMIF('Registrar despeses'!A:A,D24,'Registrar despeses'!C:C))","v":""},""]
[null,null,8,null,null,{"$f":"IF(D25=\"\",\"\",SUMIF('Registrar despeses'!A:A,D25,'Registrar despeses'!C:C))","v":""},""]
[null,null,9,null,null,{"$f":"IF(D26=\"\",\"\",SUMIF('Registrar despeses'!A:A,D26,'Registrar despeses'!C:C))","v":""},""]
[null,null,10,null,null,{"$f":"IF(D27=\"\",\"\",SUMIF('Registrar despeses'!A:A,D27,'Registrar despeses'!C:C))","v":""},""]
[null,null,11,null,null,{"$f":"IF(D28=\"\",\"\",SUMIF('Registrar despeses'!A:A,D28,'Registrar despeses'!C:C))","v":""},""]
[null,null,12,null,null,{"$f":"IF(D29=\"\",\"\",SUMIF('Registrar despeses'!A:A,D29,'Registrar despeses'!C:C))","v":""},""]
[null,null,13,null,null,{"$f":"IF(D30=\"\",\"\",SUMIF('Registrar despeses'!A:A,D30,'Registrar despeses'!C:C))","v":""},""]
[null,null,14,null,null,{"$f":"IF(D31=\"\",\"\",SUMIF('Registrar despeses'!A:A,D31,'Registrar despeses'!C:C))","v":""},""]
[null,null,15,null,null,{"$f":"IF(D32=\"\",\"\",SUMIF('Registrar despeses'!A:A,D32,'Registrar despeses'!C:C))","v":""},""]
[null,null,16,null,null,{"$f":"IF(D33=\"\",\"\",SUMIF('Registrar despeses'!A:A,D33,'Registrar despeses'!C:C))","v":""},""]
[null,null,17,null,null,{"$f":"IF(D34=\"\",\"\",SUMIF('Registrar despeses'!A:A,D34,'Registrar despeses'!C:C))","v":""},""]
[null,null,18,null,null,{"$f":"IF(D35=\"\",\"\",SUMIF('Registrar despeses'!A:A,D35,'Registrar despeses'!C:C))","v":""},""]
[null,null,19,null,null,{"$f":"IF(D36=\"\",\"\",SUMIF('Registrar despeses'!A:A,D36,'Registrar despeses'!C:C))","v":""},""]
[null,null,20,null,null,{"$f":"IF(D37=\"\",\"\",SUMIF('Registrar despeses'!A:A,D37,'Registrar despeses'!C:C))","v":""},""]
[null,null,21,null,null,{"$f":"IF(D38=\"\",\"\",SUMIF('Registrar despeses'!A:A,D38,'Registrar despeses'!C:C))","v":""},""]
[null,null,22,null,null,{"$f":"IF(D39=\"\",\"\",SUMIF('Registrar despeses'!A:A,D39,'Registrar despeses'!C:C))","v":""},""]
[null,null,23,null,null,{"$f":"IF(D40=\"\",\"\",SUMIF('Registrar despeses'!A:A,D40,'Registrar despeses'!C:C))","v":""},""]
[null,null,24,null,null,{"$f":"IF(D41=\"\",\"\",SUMIF('Registrar despeses'!A:A,D41,'Registrar despeses'!C:C))","v":""},""]
[null,null,25,null,null,{"$f":"IF(D42=\"\",\"\",SUMIF('Registrar despeses'!A:A,D42,'Registrar despeses'!C:C))","v":""},""]
[null,null,26,null,null,{"$f":"IF(D43=\"\",\"\",SUMIF('Registrar despeses'!A:A,D43,'Registrar despeses'!C:C))","v":""},""]
[null,null,27,null,null,{"$f":"IF(D44=\"\",\"\",SUMIF('Registrar despeses'!A:A,D44,'Registrar despeses'!C:C))","v":""},""]
[null,null,28,null,null,{"$f":"IF(D45=\"\",\"\",SUMIF('Registrar despeses'!A:A,D45,'Registrar despeses'!C:C))","v":""},""]
[null,null,29,null,null,{"$f":"IF(D46=\"\",\"\",SUMIF('Registrar despeses'!A:A,D46,'Registrar despeses'!C:C))","v":""},""]
[null,null,30,null,null,{"$f":"IF(D47=\"\",\"\",SUMIF('Registrar despeses'!A:A,D47,'Registrar despeses'!C:C))","v":""},""]
[null,null,31,null,null,{"$f":"IF(D48=\"\",\"\",SUMIF('Registrar despeses'!A:A,D48,'Registrar despeses'!C:C))","v":""},""]
[null,null,32,null,null,{"$f":"IF(D49=\"\",\"\",SUMIF('Registrar despeses'!A:A,D49,'Registrar despeses'!C:C))","v":""},""]
[null,null,33,null,null,{"$f":"IF(D50=\"\",\"\",SUMIF('Registrar despeses'!A:A,D50,'Registrar despeses'!C:C))","v":""},""]
[null,null,34,null,null,{"$f":"IF(D51=\"\",\"\",SUMIF('Registrar despeses'!A:A,D51,'Registrar despeses'!C:C))","v":""},""]
[null,null,35,null," ",{"$f":"IF(D52=\"\",\"\",SUMIF('Registrar despeses'!A:A,D52,'Registrar despeses'!C:C))","v":""},""]
[]
[{"$nulls":3},"Total assignat:",{"$f":"SUM(E18:E52)","v":{"v":2,"d":"2.00"}}]

{"sheet":"Registrar despeses","index":1,"n_rows":750,"n_cols":7,"rows_kept":750,"merged":[[1,2,1,4]]}
["Registrar despeses"]
[null,null,"1) Introduïu un import per a cada despesa (o copieu i enganxeu des del vostre banc)"]
["2) Seleccioneu una categoria per a cada despesa a continuació"]
[null,"Expenses","Imports de despeses","Descripció / notes","Expenses","Expenses","Expenses"]
[]
["categoria d'exemple",null,{"v":1.1,"d":"1.10"}]
{"$rows_empty":743}
[null," "]

{"sheet":"Gràfic circular","index":2,"n_rows":36,"n_cols":10,"rows_kept":36}
["Rank","Rank + tiebreaker","true rank","Category","Expense Totals","Percent",null,"Categoria","Totals de despeses","Percentatge"]
[{"$f":"IF(E2=\"\",\"\",RANK(E2,$E$2:$E$36))","v":1},{"$f":"IF(A2=\"\",\"\",A2+ROW()/1000)","v":1.002},{"$f":"IF(B2=\"\",\"\",RANK(B2,$B$2:$B$36,1))","v":1},{"$f":"IF(Pressupost!D18=\"\",\"\",Pressupost!D18)","v":"categoria d'exemple"},{"$f":"IF(D2=\"\",\"\",ABS(Pressupost!F18))","v":{"v":1.1,"d":"1.10"}},{"$f":"IF(E2=\"\",\"\",E2/SUM($E$2:$E$36))","v":{"v":1,"d":"100.00%"}},null,{"$f":"IFERROR(VLOOKUP(ROW()-1,$C$2:$F$36,2,0),\"\")","v":"categoria d'exemple"},{"$f":"IFERROR(VLOOKUP(ROW()-1,$C$2:$F$36,3,0),\"\")","v":{"v":1.1,"d":"1.10"}},{"$f":"IFERROR(VLOOKUP(ROW()-1,$C$2:$F$36,4,0),\"\")","v":{"v":1,"d":"100.0%"}}]
[2,2.003,2,{"$f":"IF(Pressupost!D19=\"\",\"\",Pressupost!D19)","v":"hipoteca"},{"$f":"IF(D3=\"\",\"\",ABS(Pressupost!F19))","v":{"v":0,"d":"0.00"}},{"v":0,"d":"0.0%"},null,"hipoteca",{"v":0,"d":"0.00"},{"v":0,"d":"0.0%"}]
[2,2.004,3,{"$f":"IF(Pressupost!D20=\"\",\"\",Pressupost!D20)","v":"gasolina"},{"$f":"IF(D4=\"\",\"\",ABS(Pressupost!F20))","v":{"v":0,"d":"0.00"}},{"v":0,"d":"0.0%"},null,"gasolina",{"v":0,"d":"0.00"},{"v":0,"d":"0.0%"}]
[2,2.005,4,{"$f":"IF(Pressupost!D21=\"\",\"\",Pressupost!D21)","v":"queviures"},{"$f":"IF(D5=\"\",\"\",ABS(Pressupost!F21))","v":{"v":0,"d":"0.00"}},{"v":0,"d":"0.0%"},null,"queviures",{"v":0,"d":"0.00"},{"v":0,"d":"0.0%"}]
[2,2.006,5,{"$f":"IF(Pressupost!D22=\"\",\"\",Pressupost!D22)","v":"restaurants"},{"$f":"IF(D6=\"\",\"\",ABS(Pressupost!F22))","v":{"v":0,"d":"0.00"}},{"v":0,"d":"0.0%"},null,"restaurants",{"v":0,"d":"0.00"},{"v":0,"d":"0.0%"}]
["","","",{"$f":"IF(Pressupost!D23=\"\",\"\",Pressupost!D23)","v":""},{"$f":"IF(D7=\"\",\"\",ABS(Pressupost!F23))","v":""},"",null,"","",""]
["","","",{"$f":"IF(Pressupost!D24=\"\",\"\",Pressupost!D24)","v":""},{"$f":"IF(D8=\"\",\"\",ABS(Pressupost!F24))","v":""},"",null,"","",""]
["","","",{"$f":"IF(Pressupost!D25=\"\",\"\",Pressupost!D25)","v":""},{"$f":"IF(D9=\"\",\"\",ABS(Pressupost!F25))","v":""},"",null,"","",""]
["","","",{"$f":"IF(Pressupost!D26=\"\",\"\",Pressupost!D26)","v":""},{"$f":"IF(D10=\"\",\"\",ABS(Pressupost!F26))","v":""},"",null,"","",""]
["","","",{"$f":"IF(Pressupost!D27=\"\",\"\",Pressupost!D27)","v":""},{"$f":"IF(D11=\"\",\"\",ABS(Pressupost!F27))","v":""},"",null,"","",""]
["","","",{"$f":"IF(Pressupost!D28=\"\",\"\",Pressupost!D28)","v":""},{"$f":"IF(D12=\"\",\"\",ABS(Pressupost!F28))","v":""},"",null,"","",""]
["","","",{"$f":"IF(Pressupost!D29=\"\",\"\",Pressupost!D29)","v":""},{"$f":"IF(D13=\"\",\"\",ABS(Pressupost!F29))","v":""},"",null,"","",""]
["","","",{"$f":"IF(Pressupost!D30=\"\",\"\",Pressupost!D30)","v":""},{"$f":"IF(D14=\"\",\"\",ABS(Pressupost!F30))","v":""},"",null,"","",""]
["","","",{"$f":"IF(Pressupost!D31=\"\",\"\",Pressupost!D31)","v":""},{"$f":"IF(D15=\"\",\"\",ABS(Pressupost!F31))","v":""},"",null,"","",""]
["","","",{"$f":"IF(Pressupost!D32=\"\",\"\",Pressupost!D32)","v":""},{"$f":"IF(D16=\"\",\"\",ABS(Pressupost!F32))","v":""},"",null,"","",""]
["","","",{"$f":"IF(Pressupost!D33=\"\",\"\",Pressupost!D33)","v":""},{"$f":"IF(D17=\"\",\"\",ABS(Pressupost!F33))","v":""},"",null,"","",""]
["","","",{"$f":"IF(Pressupost!D34=\"\",\"\",Pressupost!D34)","v":""},{"$f":"IF(D18=\"\",\"\",ABS(Pressupost!F34))","v":""},"",null,"","",""]
["","","",{"$f":"IF(Pressupost!D35=\"\",\"\",Pressupost!D35)","v":""},{"$f":"IF(D19=\"\",\"\",ABS(Pressupost!F35))","v":""},"",null,"","",""]
["","","",{"$f":"IF(Pressupost!D36=\"\",\"\",Pressupost!D36)","v":""},{"$f":"IF(D20=\"\",\"\",ABS(Pressupost!F36))","v":""},"",null,"","",""]
["","","",{"$f":"IF(Pressupost!D37=\"\",\"\",Pressupost!D37)","v":""},{"$f":"IF(D21=\"\",\"\",ABS(Pressupost!F37))","v":""},"",null,"","",""]
["","","",{"$f":"IF(Pressupost!D38=\"\",\"\",Pressupost!D38)","v":""},{"$f":"IF(D22=\"\",\"\",ABS(Pressupost!F38))","v":""},"",null,"","",""]
["","","",{"$f":"IF(Pressupost!D39=\"\",\"\",Pressupost!D39)","v":""},{"$f":"IF(D23=\"\",\"\",ABS(Pressupost!F39))","v":""},"",null,"","",""]
["","","",{"$f":"IF(Pressupost!D40=\"\",\"\",Pressupost!D40)","v":""},{"$f":"IF(D24=\"\",\"\",ABS(Pressupost!F40))","v":""},"",null,"","",""]
["","","",{"$f":"IF(Pressupost!D41=\"\",\"\",Pressupost!D41)","v":""},{"$f":"IF(D25=\"\",\"\",ABS(Pressupost!F41))","v":""},"",null,"","",""]
["","","",{"$f":"IF(Pressupost!D42=\"\",\"\",Pressupost!D42)","v":""},{"$f":"IF(D26=\"\",\"\",ABS(Pressupost!F42))","v":""},"",null,"","",""]
["","","",{"$f":"IF(Pressupost!D43=\"\",\"\",Pressupost!D43)","v":""},{"$f":"IF(D27=\"\",\"\",ABS(Pressupost!F43))","v":""},"",null,"","",""]
["","","",{"$f":"IF(Pressupost!D44=\"\",\"\",Pressupost!D44)","v":""},{"$f":"IF(D28=\"\",\"\",ABS(Pressupost!F44))","v":""},"",null,"","",""]
["","","",{"$f":"IF(Pressupost!D45=\"\",\"\",Pressupost!D45)","v":""},{"$f":"IF(D29=\"\",\"\",ABS(Pressupost!F45))","v":""},"",null,"","",""]
["","","",{"$f":"IF(Pressupost!D46=\"\",\"\",Pressupost!D46)","v":""},{"$f":"IF(D30=\"\",\"\",ABS(Pressupost!F46))","v":""},"",null,"","",""]
["","","",{"$f":"IF(Pressupost!D47=\"\",\"\",Pressupost!D47)","v":""},{"$f":"IF(D31=\"\",\"\",ABS(Pressupost!F47))","v":""},"",null,"","",""]
["","","",{"$f":"IF(Pressupost!D48=\"\",\"\",Pressupost!D48)","v":""},{"$f":"IF(D32=\"\",\"\",ABS(Pressupost!F48))","v":""},"",null,"","",""]
["","","",{"$f":"IF(Pressupost!D49=\"\",\"\",Pressupost!D49)","v":""},{"$f":"IF(D33=\"\",\"\",ABS(Pressupost!F49))","v":""},"",null,"","",""]
["","","",{"$f":"IF(Pressupost!D50=\"\",\"\",Pressupost!D50)","v":""},{"$f":"IF(D34=\"\",\"\",ABS(Pressupost!F50))","v":""},"",null,"","",""]
["","","",{"$f":"IF(Pressupost!D51=\"\",\"\",Pressupost!D51)","v":""},{"$f":"IF(D35=\"\",\"\",ABS(Pressupost!F51))","v":""},"",null,"","",""]
["","","",{"$f":"IF(Pressupost!D52=\"\",\"\",Pressupost!D52)","v":""},{"$f":"IF(D36=\"\",\"\",ABS(Pressupost!F52))","v":""},"",null,"","",""]

{"sheet":"Despeses agrupades","index":3,"n_rows":744,"n_cols":7,"rows_kept":744}
["include both cents","concatenate other values","combine the first 2 columns","replace blanks with a unicode character like Z, for alphabetical sorting","Sort C based on D"]
[{"$f":"IF('Registrar despeses'!C6:C750=\"\",\"\",'Registrar despeses'!A6:A750 & \"     \" & TEXT('Registrar despeses'!C6:C750, \".00\") & \"          \")","v":"categoria d'exemple     1.10          "},{"$f":"IF('Registrar despeses'!C6:C750=\"\",\"\", IF('Registrar despeses'!B6:B750 = \"\", \"\",  'Registrar despeses'!B6:B750 & \"     \") &  IF('Registrar despeses'!D6:D750 = \"\", \"\",  'Registrar despeses'!D6:D750 & \"     \") & IF('Registrar despeses'!E6:E750 = \"\", \"\",  'Registrar despeses'!E6:E750 & \"     \") & IF('Registrar despeses'!F6:F750 = \"\", \"\",  'Registrar despeses'!F6:F750 & \"     \") & IF('Registrar despeses'!G6:G750 = \"\", \"\",  'Registrar despeses'!G6:G750 & \"     \") & IF('Registrar despeses'!H6:H750 = \"\", \"\",  'Registrar despeses'!H6:H750 & \"     \") & IF('Registrar despeses'!I6:I750 = \"\", \"\",  'Registrar despeses'!I6:I750 & \"     \") & IF('Registrar despeses'!J6:J750 = \"\", \"\",  'Registrar despeses'!J6:J750 & \"     \") & IF('Registrar despeses'!K6:K750 = \"\", \"\",  'Registrar despeses'!K6:K750 & \"     \") & IF('Registrar despeses'!L6:L750 = \"\", \"\",  'Registrar despeses'!L6:L750 & \"     \") & IF('Registrar despeses'!M6:M750 = \"\", \"\",  'Registrar despeses'!M6:M750 & \"     \") & IF('Registrar despeses'!N6:N750 = \"\", \"\",  'Registrar despeses'!N6:N750 & \"     \") & IF('Registrar despeses'!O6:O750 = \"\", \"\",  'Registrar despeses'!O6:O750 & \"     \") & IF('Registrar despeses'!P6:P750 = \"\", \"\",  'Registrar despeses'!P6:P750 & \"     \") & IF('Registrar despeses'!Q6:Q750 = \"\", \"\",  'Registrar despeses'!Q6:Q750 & \"     \") & IF('Registrar despeses'!R6:R750 = \"\", \"\",  'Registrar despeses'!R6:R750 & \"     \") & IF('Registrar despeses'!S6:S750 = \"\", \"\",  'Registrar despeses'!S6:S750 & \"     \") & IF('Registrar despeses'!T6:T750 = \"\", \"\",  'Registrar despeses'!T6:T750 & \"     \") & IF('Registrar despeses'!U6:U750 = \"\", \"\",  'Registrar despeses'!U6:U750 & \"     \") & IF('Registrar despeses'!V6:V750 = \"\", \"\",  'Registrar despeses'!V6:V750 & \"     \") & IF('Registrar despeses'!W6:W750 = \"\", \"\",  'Registrar despeses'!W6:W750 & \"     \") & IF('Registrar despeses'!X6:X750 = \"\", \"\",  'Registrar despeses'!X6:X750 & \"     \") & IF('Registrar despeses'!Y6:Y750 = \"\", \"\",  'Registrar despeses'!Y6:Y750 & \"     \") & IF('Registrar despeses'!Z6:Z750 = \"\", \"\",  'Registrar despeses'!Z6:Z750 & \"     \")  )","v":""},{"$f":"A2:A744 & B2:B744","v":"categoria d'exemple     1.10          "},{"$f":"IF(C2:C744 = \"\",\"𬺓𬺓𬺓\",C2:C744)","v":"categoria d'exemple     1.10          "},{"$f":"_xlfn._xlws.SORT(C2:D744,2)","v":"categoria d'exemple     1.10          "},"categoria d'exemple     1.10          ",{"$f":"E2:E744","v":"categoria d'exemple     1.10          "}]
["","","","𬺓𬺓𬺓","","𬺓𬺓𬺓",""]
["","","","𬺓𬺓𬺓","","𬺓𬺓𬺓",""]
["","","","𬺓𬺓𬺓","","𬺓𬺓𬺓",""]
["","","","𬺓𬺓𬺓","","𬺓𬺓𬺓",""]
["","","","𬺓𬺓𬺓","","𬺓𬺓𬺓",""]
["","","","𬺓𬺓𬺓","","𬺓𬺓𬺓",""]
["","","","𬺓𬺓𬺓","","𬺓𬺓𬺓",""]
["","","","𬺓𬺓𬺓","","𬺓𬺓𬺓",""]
["","","","𬺓𬺓𬺓","","𬺓𬺓𬺓",""]
["","","","𬺓𬺓𬺓","","𬺓𬺓𬺓",""]
["","","","𬺓𬺓𬺓","","𬺓𬺓𬺓",""]
["","","","𬺓𬺓𬺓","","𬺓𬺓𬺓",""]
["","","","𬺓𬺓𬺓","","𬺓𬺓𬺓",""]
["","","","𬺓𬺓𬺓","","𬺓𬺓𬺓",""]
["","","","𬺓𬺓𬺓","","𬺓𬺓𬺓",""]
["","","","𬺓𬺓𬺓","","𬺓𬺓𬺓",""]
["","","","𬺓𬺓𬺓","","𬺓𬺓𬺓",""]
["","","","𬺓𬺓𬺓","","𬺓𬺓𬺓",""]
["","","","𬺓𬺓𬺓","","𬺓𬺓𬺓",""]
["","","","𬺓𬺓𬺓","","𬺓𬺓𬺓",""]
["","","","𬺓𬺓𬺓","","𬺓𬺓𬺓",""]
["","","","𬺓𬺓𬺓","","𬺓𬺓𬺓",""]
["","","","𬺓𬺓𬺓","","𬺓𬺓𬺓",""]
["","","","𬺓𬺓𬺓","","𬺓𬺓𬺓",""]
["","","","𬺓𬺓𬺓","","𬺓𬺓𬺓",""]
["","","","𬺓𬺓𬺓","","𬺓𬺓𬺓",""]
["","","","𬺓𬺓𬺓","","𬺓𬺓𬺓",""]
["","","","𬺓𬺓𬺓","","𬺓𬺓𬺓",""]
["","","","𬺓𬺓𬺓","","𬺓𬺓𬺓",""]
["","","","𬺓𬺓𬺓","","𬺓𬺓𬺓",""]
["","","","𬺓𬺓𬺓","","𬺓𬺓𬺓",""]
["","","","𬺓𬺓𬺓","","𬺓𬺓𬺓",""]
["","","","𬺓𬺓𬺓","","𬺓𬺓𬺓",""]
["","","","𬺓𬺓𬺓","","𬺓𬺓𬺓",""]
["","","","𬺓𬺓𬺓","","𬺓𬺓𬺓",""]
["","","","𬺓𬺓𬺓","","𬺓𬺓𬺓",""]
["","","","𬺓𬺓𬺓","","𬺓𬺓𬺓",""]
["","","","𬺓𬺓𬺓","","𬺓𬺓𬺓",""]
["","","","𬺓𬺓𬺓","","𬺓𬺓𬺓",""]
["","","","𬺓𬺓𬺓","","𬺓𬺓𬺓",""]
["","","","𬺓𬺓𬺓","","𬺓𬺓𬺓",""]
["","","","𬺓𬺓𬺓","","𬺓𬺓𬺓",""]
["","","","𬺓𬺓𬺓","","𬺓𬺓𬺓",""]
["","","","𬺓𬺓𬺓","","𬺓𬺓𬺓",""]
["","","","𬺓𬺓𬺓","","𬺓𬺓𬺓",""]
["","","","𬺓𬺓𬺓","","𬺓𬺓𬺓",""]
["","","","𬺓𬺓𬺓","","𬺓𬺓𬺓",""]
["","","","𬺓𬺓𬺓","","𬺓𬺓𬺓",""]
["","","","𬺓𬺓𬺓","","𬺓𬺓𬺓",""]
["","","","𬺓𬺓𬺓","","𬺓𬺓𬺓",""]
["","","","𬺓𬺓𬺓","","𬺓𬺓𬺓",""]
["","","","𬺓𬺓𬺓","","𬺓𬺓𬺓",""]
["","","","𬺓𬺓𬺓","","𬺓𬺓𬺓",""]
["","","","𬺓𬺓𬺓","","𬺓𬺓𬺓",""]
["","","","𬺓𬺓𬺓","","𬺓𬺓𬺓",""]
["","","","𬺓𬺓𬺓","","𬺓𬺓𬺓",""]
["","","","𬺓𬺓𬺓","","𬺓𬺓𬺓",""]
["","","","𬺓𬺓𬺓","","𬺓𬺓𬺓",""]
["","","","𬺓𬺓𬺓","","𬺓𬺓𬺓",""]
["","","","𬺓𬺓𬺓","","𬺓𬺓𬺓",""]
["","","","𬺓𬺓𬺓","","𬺓𬺓𬺓",""]
["","","","𬺓𬺓𬺓","","𬺓𬺓𬺓",""]
["","","","𬺓𬺓𬺓","","𬺓𬺓𬺓",""]
["","","","𬺓𬺓𬺓","","𬺓𬺓𬺓",""]
["","","","𬺓𬺓𬺓","","𬺓𬺓𬺓",""]
["","","","𬺓𬺓𬺓","","𬺓𬺓𬺓",""]
["","","","𬺓𬺓𬺓","","𬺓𬺓𬺓",""]
["","","","𬺓𬺓𬺓","","𬺓𬺓𬺓",""]
["","","","𬺓𬺓𬺓","","𬺓𬺓𬺓",""]
["","","","𬺓𬺓𬺓","","𬺓𬺓𬺓",""]
["","","","𬺓𬺓𬺓","","𬺓𬺓𬺓",""]
["","","","𬺓𬺓𬺓","","𬺓𬺓𬺓",""]
["","","","𬺓𬺓𬺓","","𬺓𬺓𬺓",""]
["","","","𬺓𬺓𬺓","","𬺓𬺓𬺓",""]
["","","","𬺓𬺓𬺓","","𬺓𬺓𬺓",""]
["","","","𬺓𬺓𬺓","","𬺓𬺓𬺓",""]
["","","","𬺓𬺓𬺓","","𬺓𬺓𬺓",""]
["","","","𬺓𬺓𬺓","","𬺓𬺓𬺓",""]
["","","","𬺓𬺓𬺓","","𬺓𬺓𬺓",""]
["","","","𬺓𬺓𬺓","","𬺓𬺓𬺓",""]
["","","","𬺓𬺓𬺓","","𬺓𬺓𬺓",""]
["","","","𬺓𬺓𬺓","","𬺓𬺓𬺓",""]
["","","","𬺓𬺓𬺓","","𬺓𬺓𬺓",""]
["","","","𬺓𬺓𬺓","","𬺓𬺓𬺓",""]
["","","","𬺓𬺓𬺓","","𬺓𬺓𬺓",""]
["","","","𬺓𬺓𬺓","","𬺓𬺓𬺓",""]
["","","","𬺓𬺓𬺓","","𬺓𬺓𬺓",""]
["","","","𬺓𬺓𬺓","","𬺓𬺓𬺓",""]
["","","","𬺓𬺓𬺓","","𬺓𬺓𬺓",""]
["","","","𬺓𬺓𬺓","","𬺓𬺓𬺓",""]
["","","","𬺓𬺓𬺓","","𬺓𬺓𬺓",""]
["","","","𬺓𬺓𬺓","","𬺓𬺓𬺓",""]
["","","","𬺓𬺓𬺓","","𬺓𬺓𬺓",""]
["","","","𬺓𬺓𬺓","","𬺓𬺓𬺓",""]
["","","","𬺓𬺓𬺓","","𬺓𬺓𬺓",""]
["","","","𬺓𬺓𬺓","","𬺓𬺓𬺓",""]
["","","","𬺓𬺓𬺓","","𬺓𬺓𬺓",""]
["","","","𬺓𬺓𬺓","","𬺓𬺓𬺓",""]
["","","","𬺓𬺓𬺓","","𬺓𬺓𬺓",""]
["","","","𬺓𬺓𬺓","","𬺓𬺓𬺓",""]
["","","","𬺓𬺓𬺓","","𬺓𬺓𬺓",""]
["","","","𬺓𬺓𬺓","","𬺓𬺓𬺓",""]
["","","","𬺓𬺓𬺓","","𬺓𬺓𬺓",""]
["","","","𬺓𬺓𬺓","","𬺓𬺓𬺓",""]
["","","","𬺓𬺓𬺓","","𬺓𬺓𬺓",""]
["","","","𬺓𬺓𬺓","","𬺓𬺓𬺓",""]
["","","","𬺓𬺓𬺓","","𬺓𬺓𬺓",""]
["","","","𬺓𬺓𬺓","","𬺓𬺓𬺓",""]
["","","","𬺓𬺓𬺓","","𬺓𬺓𬺓",""]
["","","","𬺓𬺓𬺓","","𬺓𬺓𬺓",""]
["","","","𬺓𬺓𬺓","","𬺓𬺓𬺓",""]
["","","","𬺓𬺓𬺓","","𬺓𬺓𬺓",""]
["","","","𬺓𬺓𬺓","","𬺓𬺓𬺓",""]
["","","","𬺓𬺓𬺓","","𬺓𬺓𬺓",""]
["","","","𬺓𬺓𬺓","","𬺓𬺓𬺓",""]
["","","","𬺓𬺓𬺓","","𬺓𬺓𬺓",""]
["","","","𬺓𬺓𬺓","","𬺓𬺓𬺓",""]
["","","","𬺓𬺓𬺓","","𬺓𬺓𬺓",""]
["","","","𬺓𬺓𬺓","","𬺓𬺓𬺓",""]
["","","","𬺓𬺓𬺓","","𬺓𬺓𬺓",""]
["","","","𬺓𬺓𬺓","","𬺓𬺓𬺓",""]
["","","","𬺓𬺓𬺓","","𬺓𬺓𬺓",""]
["","","","𬺓𬺓𬺓","","𬺓𬺓𬺓",""]
["","","","𬺓𬺓𬺓","","𬺓𬺓𬺓",""]
["","","","𬺓𬺓𬺓","","𬺓𬺓𬺓",""]
["","","","𬺓𬺓𬺓","","𬺓𬺓𬺓",""]
["","","","𬺓𬺓𬺓","","𬺓𬺓𬺓",""]
["","","","𬺓𬺓𬺓","","𬺓𬺓𬺓",""]
["","","","𬺓𬺓𬺓","","𬺓𬺓𬺓",""]
["","","","𬺓𬺓𬺓","","𬺓𬺓𬺓",""]
["","","","𬺓𬺓𬺓","","𬺓𬺓𬺓",""]
["","","","𬺓𬺓𬺓","","𬺓𬺓𬺓",""]
["","","","𬺓𬺓𬺓","","𬺓𬺓𬺓",""]
["","","","𬺓𬺓𬺓","","𬺓𬺓𬺓",""]
["","","","𬺓𬺓𬺓","","𬺓𬺓𬺓",""]
["","","","𬺓𬺓𬺓","","𬺓𬺓𬺓",""]
["","","","𬺓𬺓𬺓","","𬺓𬺓𬺓",""]
["","","","𬺓𬺓𬺓","","𬺓𬺓𬺓",""]
["","","","𬺓𬺓𬺓","","𬺓𬺓𬺓",""]
["","","","𬺓𬺓𬺓","","𬺓𬺓𬺓",""]
["","","","𬺓𬺓𬺓","","𬺓𬺓𬺓",""]
["","","","𬺓𬺓𬺓","","𬺓𬺓𬺓",""]
["","","","𬺓𬺓𬺓","","𬺓𬺓𬺓",""]
["","","","𬺓𬺓𬺓","","𬺓𬺓𬺓",""]
["","","","𬺓𬺓𬺓","","𬺓𬺓𬺓",""]
["","","","𬺓𬺓𬺓","","𬺓𬺓𬺓",""]
["","","","𬺓𬺓𬺓","","𬺓𬺓𬺓",""]
["","","","𬺓𬺓𬺓","","𬺓𬺓𬺓",""]
["","","","𬺓𬺓𬺓","","𬺓𬺓𬺓",""]
["","","","𬺓𬺓𬺓","","𬺓𬺓𬺓",""]
["","","","𬺓𬺓𬺓","","𬺓𬺓𬺓",""]
["","","","𬺓𬺓𬺓","","𬺓𬺓𬺓",""]
["","","","𬺓𬺓𬺓","","𬺓𬺓𬺓",""]
["","","","𬺓𬺓𬺓","","𬺓𬺓𬺓",""]
["","","","𬺓𬺓𬺓","","𬺓𬺓𬺓",""]
["","","","𬺓𬺓𬺓","","𬺓𬺓𬺓",""]
["","","","𬺓𬺓𬺓","","𬺓𬺓𬺓",""]
["","","","𬺓𬺓𬺓","","𬺓𬺓𬺓",""]
["","","","𬺓𬺓𬺓","","𬺓𬺓𬺓",""]
["","","","𬺓𬺓𬺓","","𬺓𬺓𬺓",""]
["","","","𬺓𬺓𬺓","","𬺓𬺓𬺓",""]
["","","","𬺓𬺓𬺓","","𬺓𬺓𬺓",""]
["","","","𬺓𬺓𬺓","","𬺓𬺓𬺓",""]
["","","","𬺓𬺓𬺓","","𬺓𬺓𬺓",""]
["","","","𬺓𬺓𬺓","","𬺓𬺓𬺓",""]
["","","","𬺓𬺓𬺓","","𬺓𬺓𬺓",""]
["","","","𬺓𬺓𬺓","","𬺓𬺓𬺓",""]
["","","","𬺓𬺓𬺓","","𬺓𬺓𬺓",""]
["","","","𬺓𬺓𬺓","","𬺓𬺓𬺓",""]
["","","","𬺓𬺓𬺓","","𬺓𬺓𬺓",""]
["","","","𬺓𬺓𬺓","","𬺓𬺓𬺓",""]
["","","","𬺓𬺓𬺓","","𬺓𬺓𬺓",""]
["","","","𬺓𬺓𬺓","","𬺓𬺓𬺓",""]
["","","","𬺓𬺓𬺓","","𬺓𬺓𬺓",""]
["","","","𬺓𬺓𬺓","","𬺓𬺓𬺓",""]
["","","","𬺓𬺓𬺓","","𬺓𬺓𬺓",""]
["","","","𬺓𬺓𬺓","","𬺓𬺓𬺓",""]
["","","","𬺓𬺓𬺓","","𬺓𬺓𬺓",""]
["","","","𬺓𬺓𬺓","","𬺓𬺓𬺓",""]
["","","","𬺓𬺓𬺓","","𬺓𬺓𬺓",""]
["","","","𬺓𬺓𬺓","","𬺓𬺓𬺓",""]
["","","","𬺓𬺓𬺓","","𬺓𬺓𬺓",""]
["","","","𬺓𬺓𬺓","","𬺓𬺓𬺓",""]
["","","","𬺓𬺓𬺓","","𬺓𬺓𬺓",""]
["","","","𬺓𬺓𬺓","","𬺓𬺓𬺓",""]
["","","","𬺓𬺓𬺓","","𬺓𬺓𬺓",""]
["","","","𬺓𬺓𬺓","","𬺓𬺓𬺓",""]
["","","","𬺓𬺓𬺓","","𬺓𬺓𬺓",""]
["","","","𬺓𬺓𬺓","","𬺓𬺓𬺓",""]
["","","","𬺓𬺓𬺓","","𬺓𬺓𬺓",""]
["","","","𬺓𬺓𬺓","","𬺓𬺓𬺓",""]
["","","","𬺓𬺓𬺓","","𬺓𬺓𬺓",""]
["","","","𬺓𬺓𬺓","","𬺓𬺓𬺓",""]
["","","","𬺓𬺓𬺓","","𬺓𬺓𬺓",""]
["","","","𬺓𬺓𬺓","","𬺓𬺓𬺓",""]
["","","","𬺓𬺓𬺓","","𬺓𬺓𬺓",""]
["","","","𬺓𬺓𬺓","","𬺓𬺓𬺓",""]
["","","","𬺓𬺓𬺓","","𬺓𬺓𬺓",""]
["","","","𬺓𬺓𬺓","","𬺓𬺓𬺓",""]
["","","","𬺓𬺓𬺓","","𬺓𬺓𬺓",""]
["","","","𬺓𬺓𬺓","","𬺓𬺓𬺓",""]
["","","","𬺓𬺓𬺓","","𬺓𬺓𬺓",""]
["","","","𬺓𬺓𬺓","","𬺓𬺓𬺓",""]
["","","","𬺓𬺓𬺓","","𬺓𬺓𬺓",""]
["","","","𬺓𬺓𬺓","","𬺓𬺓𬺓",""]
["","","","𬺓𬺓𬺓","","𬺓𬺓𬺓",""]
["","","","𬺓𬺓𬺓","","𬺓𬺓𬺓",""]
["","","","𬺓𬺓𬺓","","𬺓𬺓𬺓",""]
["","","","𬺓𬺓𬺓","","𬺓𬺓𬺓",""]
["","","","𬺓𬺓𬺓","","𬺓𬺓𬺓",""]
["","","","𬺓𬺓𬺓","","𬺓𬺓𬺓",""]
["","","","𬺓𬺓𬺓","","𬺓𬺓𬺓",""]
["","","","𬺓𬺓𬺓","","𬺓𬺓𬺓",""]
["","","","𬺓𬺓𬺓","","𬺓𬺓𬺓",""]
["","","","𬺓𬺓𬺓","","𬺓𬺓𬺓",""]
["","","","𬺓𬺓𬺓","","𬺓𬺓𬺓",""]
["","","","𬺓𬺓𬺓","","𬺓𬺓𬺓",""]
["","","","𬺓𬺓𬺓","","𬺓𬺓𬺓",""]
["","","","𬺓𬺓𬺓","","𬺓𬺓𬺓",""]
["","","","𬺓𬺓𬺓","","𬺓𬺓𬺓",""]
["","","","𬺓𬺓𬺓","","𬺓𬺓𬺓",""]
["","","","𬺓𬺓𬺓","","𬺓𬺓𬺓",""]
["","","","𬺓𬺓𬺓","","𬺓𬺓𬺓",""]
["","","","𬺓𬺓𬺓","","𬺓𬺓𬺓",""]
["","","","𬺓𬺓𬺓","","𬺓𬺓𬺓",""]
["","","","𬺓𬺓𬺓","","𬺓𬺓𬺓",""]
["","","","𬺓𬺓𬺓","","𬺓𬺓𬺓",""]
["","","","𬺓𬺓𬺓","","𬺓𬺓𬺓",""]
["","","","𬺓𬺓𬺓","","𬺓𬺓𬺓",""]
["","","","𬺓𬺓𬺓","","𬺓𬺓𬺓",""]
["","","","𬺓𬺓𬺓","","𬺓𬺓𬺓",""]
["","","","𬺓𬺓𬺓","","𬺓𬺓𬺓",""]
["","","","𬺓𬺓𬺓","","𬺓𬺓𬺓",""]
["","","","𬺓𬺓𬺓","","𬺓𬺓𬺓",""]
["","","","𬺓𬺓𬺓","","𬺓𬺓𬺓",""]
["","","","𬺓𬺓𬺓","","𬺓𬺓𬺓",""]
["","","","𬺓𬺓𬺓","","𬺓𬺓𬺓",""]
["","","","𬺓𬺓𬺓","","𬺓𬺓𬺓",""]
["","","","𬺓𬺓𬺓","","𬺓𬺓𬺓",""]
["","","","𬺓𬺓𬺓","","𬺓𬺓𬺓",""]
["","","","𬺓𬺓𬺓","","𬺓𬺓𬺓",""]
["","","","𬺓𬺓𬺓","","𬺓𬺓𬺓",""]
["","","","𬺓𬺓𬺓","","𬺓𬺓𬺓",""]
["","","","𬺓𬺓𬺓","","𬺓𬺓𬺓",""]
["","","","𬺓𬺓𬺓","","𬺓𬺓𬺓",""]
["","","","𬺓𬺓𬺓","","𬺓𬺓𬺓",""]
["","","","𬺓𬺓𬺓","","𬺓𬺓𬺓",""]
["","","","𬺓𬺓𬺓","","𬺓𬺓𬺓",""]
["","","","𬺓𬺓𬺓","","𬺓𬺓𬺓",""]
["","","","𬺓𬺓𬺓","","𬺓𬺓𬺓",""]
["","","","𬺓𬺓𬺓","","𬺓𬺓𬺓",""]
["","","","𬺓𬺓𬺓","","𬺓𬺓𬺓",""]
["","","","𬺓𬺓𬺓","","𬺓𬺓𬺓",""]
["","","","𬺓𬺓𬺓","","𬺓𬺓𬺓",""]
["","","","𬺓𬺓𬺓","","𬺓𬺓𬺓",""]
["","","","𬺓𬺓𬺓","","𬺓𬺓𬺓",""]
["","","","𬺓𬺓𬺓","","𬺓𬺓𬺓",""]
["","","","𬺓𬺓𬺓","","𬺓𬺓𬺓",""]
["","","","𬺓𬺓𬺓","","𬺓𬺓𬺓",""]
["","","","𬺓𬺓𬺓","","𬺓𬺓𬺓",""]
["","","","𬺓𬺓𬺓","","𬺓𬺓𬺓",""]
["","","","𬺓𬺓𬺓","","𬺓𬺓𬺓",""]
["","","","𬺓𬺓𬺓","","𬺓𬺓𬺓",""]
["","","","𬺓𬺓𬺓","","𬺓𬺓𬺓",""]
["","","","𬺓𬺓𬺓","","𬺓𬺓𬺓",""]
["","","","𬺓𬺓𬺓","","𬺓𬺓𬺓",""]
["","","","𬺓𬺓𬺓","","𬺓𬺓𬺓",""]
["","","","𬺓𬺓𬺓","","𬺓𬺓𬺓",""]
["","","","𬺓𬺓𬺓","","𬺓𬺓𬺓",""]
["","","","𬺓𬺓𬺓","","𬺓𬺓𬺓",""]
["","","","𬺓𬺓𬺓","","𬺓𬺓𬺓",""]
["","","","𬺓𬺓𬺓","","𬺓𬺓𬺓",""]
["","","","𬺓𬺓𬺓","","𬺓𬺓𬺓",""]
["","","","𬺓𬺓𬺓","","𬺓𬺓𬺓",""]
["","","","𬺓𬺓𬺓","","𬺓𬺓𬺓",""]
["","","","𬺓𬺓𬺓","","𬺓𬺓𬺓",""]
["","","","𬺓𬺓𬺓","","𬺓𬺓𬺓",""]
["","","","𬺓𬺓𬺓","","𬺓𬺓𬺓",""]
["","","","𬺓𬺓𬺓","","𬺓𬺓𬺓",""]
["","","","𬺓𬺓𬺓","","𬺓𬺓𬺓",""]
["","","","𬺓𬺓𬺓","","𬺓𬺓𬺓",""]
["","","","𬺓𬺓𬺓","","𬺓𬺓𬺓",""]
["","","","𬺓𬺓𬺓","","𬺓𬺓𬺓",""]
["","","","𬺓𬺓𬺓","","𬺓𬺓𬺓",""]
["","","","𬺓𬺓𬺓","","𬺓𬺓𬺓",""]
["","","","𬺓𬺓𬺓","","𬺓𬺓𬺓",""]
["","","","𬺓𬺓𬺓","","𬺓𬺓𬺓",""]
["","","","𬺓𬺓𬺓","","𬺓𬺓𬺓",""]
["","","","𬺓𬺓𬺓","","𬺓𬺓𬺓",""]
["","","","𬺓𬺓𬺓","","𬺓𬺓𬺓",""]
["","","","𬺓𬺓𬺓","","𬺓𬺓𬺓",""]
["","","","𬺓𬺓𬺓","","𬺓𬺓𬺓",""]
["","","","𬺓𬺓𬺓","","𬺓𬺓𬺓",""]
["","","","𬺓𬺓𬺓","","𬺓𬺓𬺓",""]
["","","","𬺓𬺓𬺓","","𬺓𬺓𬺓",""]
["","","","𬺓𬺓𬺓","","𬺓𬺓𬺓",""]
["","","","𬺓𬺓𬺓","","𬺓𬺓𬺓",""]
["","","","𬺓𬺓𬺓","","𬺓𬺓𬺓",""]
["","","","𬺓𬺓𬺓","","𬺓𬺓𬺓",""]
["","","","𬺓𬺓𬺓","","𬺓𬺓𬺓",""]
["","","","𬺓𬺓𬺓","","𬺓𬺓𬺓",""]
["","","","𬺓𬺓𬺓","","𬺓𬺓𬺓",""]
["","","","𬺓𬺓𬺓","","𬺓𬺓𬺓",""]
["","","","𬺓𬺓𬺓","","𬺓𬺓𬺓",""]
["","","","𬺓𬺓𬺓","","𬺓𬺓𬺓",""]
["","","","𬺓𬺓𬺓","","𬺓𬺓𬺓",""]
["","","","𬺓𬺓𬺓","","𬺓𬺓𬺓",""]
["","","","𬺓𬺓𬺓","","𬺓𬺓𬺓",""]
["","","","𬺓𬺓𬺓","","𬺓𬺓𬺓",""]
["","","","𬺓𬺓𬺓","","𬺓𬺓𬺓",""]
["","","","𬺓𬺓𬺓","","𬺓𬺓𬺓",""]
["","","","𬺓𬺓𬺓","","𬺓𬺓𬺓",""]
["","","","𬺓𬺓𬺓","","𬺓𬺓𬺓",""]
["","","","𬺓𬺓𬺓","","𬺓𬺓𬺓",""]
["","","","𬺓𬺓𬺓","","𬺓𬺓𬺓",""]
["","","","𬺓𬺓𬺓","","𬺓𬺓𬺓",""]
["","","","𬺓𬺓𬺓","","𬺓𬺓𬺓",""]
["","","","𬺓𬺓𬺓","","𬺓𬺓𬺓",""]
["","","","𬺓𬺓𬺓","","𬺓𬺓𬺓",""]
["","","","𬺓𬺓𬺓","","𬺓𬺓𬺓",""]
["","","","𬺓𬺓𬺓","","𬺓𬺓𬺓",""]
["","","","𬺓𬺓𬺓","","𬺓𬺓𬺓",""]
["","","","𬺓𬺓𬺓","","𬺓𬺓𬺓",""]
["","","","𬺓𬺓𬺓","","𬺓𬺓𬺓",""]
["","","","𬺓𬺓𬺓","","𬺓𬺓𬺓",""]
["","","","𬺓𬺓𬺓","","𬺓𬺓𬺓",""]
["","","","𬺓𬺓𬺓","","𬺓𬺓𬺓",""]
["","","","𬺓𬺓𬺓","","𬺓𬺓𬺓",""]
["","","","𬺓𬺓𬺓","","𬺓𬺓𬺓",""]
["","","","𬺓𬺓𬺓","","𬺓𬺓𬺓",""]
["","","","𬺓𬺓𬺓","","𬺓𬺓𬺓",""]
["","","","𬺓𬺓𬺓","","𬺓𬺓𬺓",""]
["","","","𬺓𬺓𬺓","","𬺓𬺓𬺓",""]
["","","","𬺓𬺓𬺓","","𬺓𬺓𬺓",""]
["","","","𬺓𬺓𬺓","","𬺓𬺓𬺓",""]
["","","","𬺓𬺓𬺓","","𬺓𬺓𬺓",""]
["","","","𬺓𬺓𬺓","","𬺓𬺓𬺓",""]
["","","","𬺓𬺓𬺓","","𬺓𬺓𬺓",""]
["","","","𬺓𬺓𬺓","","𬺓𬺓𬺓",""]
["","","","𬺓𬺓𬺓","","𬺓𬺓𬺓",""]
["","","","𬺓𬺓𬺓","","𬺓𬺓𬺓",""]
["","","","𬺓𬺓𬺓","","𬺓𬺓𬺓",""]
["","","","𬺓𬺓𬺓","","𬺓𬺓𬺓",""]
["","","","𬺓𬺓𬺓","","𬺓𬺓𬺓",""]
["","","","𬺓𬺓𬺓","","𬺓𬺓𬺓",""]
["","","","𬺓𬺓𬺓","","𬺓𬺓𬺓",""]
["","","","𬺓𬺓𬺓","","𬺓𬺓𬺓",""]
["","","","𬺓𬺓𬺓","","𬺓𬺓𬺓",""]
["","","","𬺓𬺓𬺓","","𬺓𬺓𬺓",""]
["","","","𬺓𬺓𬺓","","𬺓𬺓𬺓",""]
["","","","𬺓𬺓𬺓","","𬺓𬺓𬺓",""]
["","","","𬺓𬺓𬺓","","𬺓𬺓𬺓",""]
["","","","𬺓𬺓𬺓","","𬺓𬺓𬺓",""]
["","","","𬺓𬺓𬺓","","𬺓𬺓𬺓",""]
["","","","𬺓𬺓𬺓","","𬺓𬺓𬺓",""]
["","","","𬺓𬺓𬺓","","𬺓𬺓𬺓",""]
["","","","𬺓𬺓𬺓","","𬺓𬺓𬺓",""]
["","","","𬺓𬺓𬺓","","𬺓𬺓𬺓",""]
["","","","𬺓𬺓𬺓","","𬺓𬺓𬺓",""]
["","","","𬺓𬺓𬺓","","𬺓𬺓𬺓",""]
["","","","𬺓𬺓𬺓","","𬺓𬺓𬺓",""]
["","","","𬺓𬺓𬺓","","𬺓𬺓𬺓",""]
["","","","𬺓𬺓𬺓","","𬺓𬺓𬺓",""]
["","","","𬺓𬺓𬺓","","𬺓𬺓𬺓",""]
["","","","𬺓𬺓𬺓","","𬺓𬺓𬺓",""]
["","","","𬺓𬺓𬺓","","𬺓𬺓𬺓",""]
["","","","𬺓𬺓𬺓","","𬺓𬺓𬺓",""]
["","","","𬺓𬺓𬺓","","𬺓𬺓𬺓",""]
["","","","𬺓𬺓𬺓","","𬺓𬺓𬺓",""]
["","","","𬺓𬺓𬺓","","𬺓𬺓𬺓",""]
["","","","𬺓𬺓𬺓","","𬺓𬺓𬺓",""]
["","","","𬺓𬺓𬺓","","𬺓𬺓𬺓",""]
["","","","𬺓𬺓𬺓","","𬺓𬺓𬺓",""]
["","","","𬺓𬺓𬺓","","𬺓𬺓𬺓",""]
["","","","𬺓𬺓𬺓","","𬺓𬺓𬺓",""]
["","","","𬺓𬺓𬺓","","𬺓𬺓𬺓",""]
["","","","𬺓𬺓𬺓","","𬺓𬺓𬺓",""]
["","","","𬺓𬺓𬺓","","𬺓𬺓𬺓",""]
["","","","𬺓𬺓𬺓","","𬺓𬺓𬺓",""]
["","","","𬺓𬺓𬺓","","𬺓𬺓𬺓",""]
["","","","𬺓𬺓𬺓","","𬺓𬺓𬺓",""]
["","","","𬺓𬺓𬺓","","𬺓𬺓𬺓",""]
["","","","𬺓𬺓𬺓","","𬺓𬺓𬺓",""]
["","","","𬺓𬺓𬺓","","𬺓𬺓𬺓",""]
["","","","𬺓𬺓𬺓","","𬺓𬺓𬺓",""]
["","","","𬺓𬺓𬺓","","𬺓𬺓𬺓",""]
["","","","𬺓𬺓𬺓","","𬺓𬺓𬺓",""]
["","","","𬺓𬺓𬺓","","𬺓𬺓𬺓",""]
["","","","𬺓𬺓𬺓","","𬺓𬺓𬺓",""]
["","","","𬺓𬺓𬺓","","𬺓𬺓𬺓",""]
["","","","𬺓𬺓𬺓","","𬺓𬺓𬺓",""]
["","","","𬺓𬺓𬺓","","𬺓𬺓𬺓",""]
["","","","𬺓𬺓𬺓","","𬺓𬺓𬺓",""]
["","","","𬺓𬺓𬺓","","𬺓𬺓𬺓",""]
["","","","𬺓𬺓𬺓","","𬺓𬺓𬺓",""]
["","","","𬺓𬺓𬺓","","𬺓𬺓𬺓",""]
["","","","𬺓𬺓𬺓","","𬺓𬺓𬺓",""]
["","","","𬺓𬺓𬺓","","𬺓𬺓𬺓",""]
["","","","𬺓𬺓𬺓","","𬺓𬺓𬺓",""]
["","","","𬺓𬺓𬺓","","𬺓𬺓𬺓",""]
["","","","𬺓𬺓𬺓","","𬺓𬺓𬺓",""]
["","","","𬺓𬺓𬺓","","𬺓𬺓𬺓",""]
["","","","𬺓𬺓𬺓","","𬺓𬺓𬺓",""]
["","","","𬺓𬺓𬺓","","𬺓𬺓𬺓",""]
["","","","𬺓𬺓𬺓","","𬺓𬺓𬺓",""]
["","","","𬺓𬺓𬺓","","𬺓𬺓𬺓",""]
["","","","𬺓𬺓𬺓","","𬺓𬺓𬺓",""]
["","","","𬺓𬺓𬺓","","𬺓𬺓𬺓",""]
["","","","𬺓𬺓𬺓","","𬺓𬺓𬺓",""]
["","","","𬺓𬺓𬺓","","𬺓𬺓𬺓",""]
["","","","𬺓𬺓𬺓","","𬺓𬺓𬺓",""]
["","","","𬺓𬺓𬺓","","𬺓𬺓𬺓",""]
["","","","𬺓𬺓𬺓","","𬺓𬺓𬺓",""]
["","","","𬺓𬺓𬺓","","𬺓𬺓𬺓",""]
["","","","𬺓𬺓𬺓","","𬺓𬺓𬺓",""]
["","","","𬺓𬺓𬺓","","𬺓𬺓𬺓",""]
["","","","𬺓𬺓𬺓","","𬺓𬺓𬺓",""]
["","","","𬺓𬺓𬺓","","𬺓𬺓𬺓",""]
["","","","𬺓𬺓𬺓","","𬺓𬺓𬺓",""]
["","","","𬺓𬺓𬺓","","𬺓𬺓𬺓",""]
["","","","𬺓𬺓𬺓","","𬺓𬺓𬺓",""]
["","","","𬺓𬺓𬺓","","𬺓𬺓𬺓",""]
["","","","𬺓𬺓𬺓","","𬺓𬺓𬺓",""]
["","","","𬺓𬺓𬺓","","𬺓𬺓𬺓",""]
["","","","𬺓𬺓𬺓","","𬺓𬺓𬺓",""]
["","","","𬺓𬺓𬺓","","𬺓𬺓𬺓",""]
["","","","𬺓𬺓𬺓","","𬺓𬺓𬺓",""]
["","","","𬺓𬺓𬺓","","𬺓𬺓𬺓",""]
["","","","𬺓𬺓𬺓","","𬺓𬺓𬺓",""]
["","","","𬺓𬺓𬺓","","𬺓𬺓𬺓",""]
["","","","𬺓𬺓𬺓","","𬺓𬺓𬺓",""]
["","","","𬺓𬺓𬺓","","𬺓𬺓𬺓",""]
["","","","𬺓𬺓𬺓","","𬺓𬺓𬺓",""]
["","","","𬺓𬺓𬺓","","𬺓𬺓𬺓",""]
["","","","𬺓𬺓𬺓","","𬺓𬺓𬺓",""]
["","","","𬺓𬺓𬺓","","𬺓𬺓𬺓",""]
["","","","𬺓𬺓𬺓","","𬺓𬺓𬺓",""]
["","","","𬺓𬺓𬺓","","𬺓𬺓𬺓",""]
["","","","𬺓𬺓𬺓","","𬺓𬺓𬺓",""]
["","","","𬺓𬺓𬺓","","𬺓𬺓𬺓",""]
["","","","𬺓𬺓𬺓","","𬺓𬺓𬺓",""]
["","","","𬺓𬺓𬺓","","𬺓𬺓𬺓",""]
["","","","𬺓𬺓𬺓","","𬺓𬺓𬺓",""]
["","","","𬺓𬺓𬺓","","𬺓𬺓𬺓",""]
["","","","𬺓𬺓𬺓","","𬺓𬺓𬺓",""]
["","","","𬺓𬺓𬺓","","𬺓𬺓𬺓",""]
["","","","𬺓𬺓𬺓","","𬺓𬺓𬺓",""]
["","","","𬺓𬺓𬺓","","𬺓𬺓𬺓",""]
["","","","𬺓𬺓𬺓","","𬺓𬺓𬺓",""]
["","","","𬺓𬺓𬺓","","𬺓𬺓𬺓",""]
["","","","𬺓𬺓𬺓","","𬺓𬺓𬺓",""]
["","","","𬺓𬺓𬺓","","𬺓𬺓𬺓",""]
["","","","𬺓𬺓𬺓","","𬺓𬺓𬺓",""]
["","","","𬺓𬺓𬺓","","𬺓𬺓𬺓",""]
["","","","𬺓𬺓𬺓","","𬺓𬺓𬺓",""]
["","","","𬺓𬺓𬺓","","𬺓𬺓𬺓",""]
["","","","𬺓𬺓𬺓","","𬺓𬺓𬺓",""]
["","","","𬺓𬺓𬺓","","𬺓𬺓𬺓",""]
["","","","𬺓𬺓𬺓","","𬺓𬺓𬺓",""]
["","","","𬺓𬺓𬺓","","𬺓𬺓𬺓",""]
["","","","𬺓𬺓𬺓","","𬺓𬺓𬺓",""]
["","","","𬺓𬺓𬺓","","𬺓𬺓𬺓",""]
["","","","𬺓𬺓𬺓","","𬺓𬺓𬺓",""]
["","","","𬺓𬺓𬺓","","𬺓𬺓𬺓",""]
["","","","𬺓𬺓𬺓","","𬺓𬺓𬺓",""]
["","","","𬺓𬺓𬺓","","𬺓𬺓𬺓",""]
["","","","𬺓𬺓𬺓","","𬺓𬺓𬺓",""]
["","","","𬺓𬺓𬺓","","𬺓𬺓𬺓",""]
["","","","𬺓𬺓𬺓","","𬺓𬺓𬺓",""]
["","","","𬺓𬺓𬺓","","𬺓𬺓𬺓",""]
["","","","𬺓𬺓𬺓","","𬺓𬺓𬺓",""]
["","","","𬺓𬺓𬺓","","𬺓𬺓𬺓",""]
["","","","𬺓𬺓𬺓","","𬺓𬺓𬺓",""]
["","","","𬺓𬺓𬺓","","𬺓𬺓𬺓",""]
["","","","𬺓𬺓𬺓","","𬺓𬺓𬺓",""]
["","","","𬺓𬺓𬺓","","𬺓𬺓𬺓",""]
["","","","𬺓𬺓𬺓","","𬺓𬺓𬺓",""]
["","","","𬺓𬺓𬺓","","𬺓𬺓𬺓",""]
["","","","𬺓𬺓𬺓","","𬺓𬺓𬺓",""]
["","","","𬺓𬺓𬺓","","𬺓𬺓𬺓",""]
["","","","𬺓𬺓𬺓","","𬺓𬺓𬺓",""]
["","","","𬺓𬺓𬺓","","𬺓𬺓𬺓",""]
["","","","𬺓𬺓𬺓","","𬺓𬺓𬺓",""]
["","","","𬺓𬺓𬺓","","𬺓𬺓𬺓",""]
["","","","𬺓𬺓𬺓","","𬺓𬺓𬺓",""]
["","","","𬺓𬺓𬺓","","𬺓𬺓𬺓",""]
["","","","𬺓𬺓𬺓","","𬺓𬺓𬺓",""]
["","","","𬺓𬺓𬺓","","𬺓𬺓𬺓",""]
["","","","𬺓𬺓𬺓","","𬺓𬺓𬺓",""]
["","","","𬺓𬺓𬺓","","𬺓𬺓𬺓",""]
["","","","𬺓𬺓𬺓","","𬺓𬺓𬺓",""]
["","","","𬺓𬺓𬺓","","𬺓𬺓𬺓",""]
["","","","𬺓𬺓𬺓","","𬺓𬺓𬺓",""]
["","","","𬺓𬺓𬺓","","𬺓𬺓𬺓",""]
["","","","𬺓𬺓𬺓","","𬺓𬺓𬺓",""]
["","","","𬺓𬺓𬺓","","𬺓𬺓𬺓",""]
["","","","𬺓𬺓𬺓","","𬺓𬺓𬺓",""]
["","","","𬺓𬺓𬺓","","𬺓𬺓𬺓",""]
["","","","𬺓𬺓𬺓","","𬺓𬺓𬺓",""]
["","","","𬺓𬺓𬺓","","𬺓𬺓𬺓",""]
["","","","𬺓𬺓𬺓","","𬺓𬺓𬺓",""]
["","","","𬺓𬺓𬺓","","𬺓𬺓𬺓",""]
["","","","𬺓𬺓𬺓","","𬺓𬺓𬺓",""]
["","","","𬺓𬺓𬺓","","𬺓𬺓𬺓",""]
["","","","𬺓𬺓𬺓","","𬺓𬺓𬺓",""]
["","","","𬺓𬺓𬺓","","𬺓𬺓𬺓",""]
["","","","𬺓𬺓𬺓","","𬺓𬺓𬺓",""]
["","","","𬺓𬺓𬺓","","𬺓𬺓𬺓",""]
["","","","𬺓𬺓𬺓","","𬺓𬺓𬺓",""]
["","","","𬺓𬺓𬺓","","𬺓𬺓𬺓",""]
["","","","𬺓𬺓𬺓","","𬺓𬺓𬺓",""]
["","","","𬺓𬺓𬺓","","𬺓𬺓𬺓",""]
["","","","𬺓𬺓𬺓","","𬺓𬺓𬺓",""]
["","","","𬺓𬺓𬺓","","𬺓𬺓𬺓",""]
["","","","𬺓𬺓𬺓","","𬺓𬺓𬺓",""]
["","","","𬺓𬺓𬺓","","𬺓𬺓𬺓",""]
["","","","𬺓𬺓𬺓","","𬺓𬺓𬺓",""]
["","","","𬺓𬺓𬺓","","𬺓𬺓𬺓",""]
["","","","𬺓𬺓𬺓","","𬺓𬺓𬺓",""]
["","","","𬺓𬺓𬺓","","𬺓𬺓𬺓",""]
["","","","𬺓𬺓𬺓","","𬺓𬺓𬺓",""]
["","","","𬺓𬺓𬺓","","𬺓𬺓𬺓",""]
["","","","𬺓𬺓𬺓","","𬺓𬺓𬺓",""]
["","","","𬺓𬺓𬺓","","𬺓𬺓𬺓",""]
["","","","𬺓𬺓𬺓","","𬺓𬺓𬺓",""]
["","","","𬺓𬺓𬺓","","𬺓𬺓𬺓",""]
["","","","𬺓𬺓𬺓","","𬺓𬺓𬺓",""]
["","","","𬺓𬺓𬺓","","𬺓𬺓𬺓",""]
["","","","𬺓𬺓𬺓","","𬺓𬺓𬺓",""]
["","","","𬺓𬺓𬺓","","𬺓𬺓𬺓",""]
["","","","𬺓𬺓𬺓","","𬺓𬺓𬺓",""]
["","","","𬺓𬺓𬺓","","𬺓𬺓𬺓",""]
["","","","𬺓𬺓𬺓","","𬺓𬺓𬺓",""]
["","","","𬺓𬺓𬺓","","𬺓𬺓𬺓",""]
["","","","𬺓𬺓𬺓","","𬺓𬺓𬺓",""]
["","","","𬺓𬺓𬺓","","𬺓𬺓𬺓",""]
["","","","𬺓𬺓𬺓","","𬺓𬺓𬺓",""]
["","","","𬺓𬺓𬺓","","𬺓𬺓𬺓",""]
["","","","𬺓𬺓𬺓","","𬺓𬺓𬺓",""]
["","","","𬺓𬺓𬺓","","𬺓𬺓𬺓",""]
["","","","𬺓𬺓𬺓","","𬺓𬺓𬺓",""]
["","","","𬺓𬺓𬺓","","𬺓𬺓𬺓",""]
["","","","𬺓𬺓𬺓","","𬺓𬺓𬺓",""]
["","","","𬺓𬺓𬺓","","𬺓𬺓𬺓",""]
["","","","𬺓𬺓𬺓","","𬺓𬺓𬺓",""]
["","","","𬺓𬺓𬺓","","𬺓𬺓𬺓",""]
["","","","𬺓𬺓𬺓","","𬺓𬺓𬺓",""]
["","","","𬺓𬺓𬺓","","𬺓𬺓𬺓",""]
["","","","𬺓𬺓𬺓","","𬺓𬺓𬺓",""]
["","","","𬺓𬺓𬺓","","𬺓𬺓𬺓",""]
["","","","𬺓𬺓𬺓","","𬺓𬺓𬺓",""]
["","","","𬺓𬺓𬺓","","𬺓𬺓𬺓",""]
["","","","𬺓𬺓𬺓","","𬺓𬺓𬺓",""]
["","","","𬺓𬺓𬺓","","𬺓𬺓𬺓",""]
["","","","𬺓𬺓𬺓","","𬺓𬺓𬺓",""]
["","","","𬺓𬺓𬺓","","𬺓𬺓𬺓",""]
["","","","𬺓𬺓𬺓","","𬺓𬺓𬺓",""]
["","","","𬺓𬺓𬺓","","𬺓𬺓𬺓",""]
["","","","𬺓𬺓𬺓","","𬺓𬺓𬺓",""]
["","","","𬺓𬺓𬺓","","𬺓𬺓𬺓",""]
["","","","𬺓𬺓𬺓","","𬺓𬺓𬺓",""]
["","","","𬺓𬺓𬺓","","𬺓𬺓𬺓",""]
["","","","𬺓𬺓𬺓","","𬺓𬺓𬺓",""]
["","","","𬺓𬺓𬺓","","𬺓𬺓𬺓",""]
["","","","𬺓𬺓𬺓","","𬺓𬺓𬺓",""]
["","","","𬺓𬺓𬺓","","𬺓𬺓𬺓",""]
["","","","𬺓𬺓𬺓","","𬺓𬺓𬺓",""]
["","","","𬺓𬺓𬺓","","𬺓𬺓𬺓",""]
["","","","𬺓𬺓𬺓","","𬺓𬺓𬺓",""]
["","","","𬺓𬺓𬺓","","𬺓𬺓𬺓",""]
["","","","𬺓𬺓𬺓","","𬺓𬺓𬺓",""]
["","","","𬺓𬺓𬺓","","𬺓𬺓𬺓",""]
["","","","𬺓𬺓𬺓","","𬺓𬺓𬺓",""]
["","","","𬺓𬺓𬺓","","𬺓𬺓𬺓",""]
["","","","𬺓𬺓𬺓","","𬺓𬺓𬺓",""]
["","","","𬺓𬺓𬺓","","𬺓𬺓𬺓",""]
["","","","𬺓𬺓𬺓","","𬺓𬺓𬺓",""]
["","","","𬺓𬺓𬺓","","𬺓𬺓𬺓",""]
["","","","𬺓𬺓𬺓","","𬺓𬺓𬺓",""]
["","","","𬺓𬺓𬺓","","𬺓𬺓𬺓",""]
["","","","𬺓𬺓𬺓","","𬺓𬺓𬺓",""]
["","","","𬺓𬺓𬺓","","𬺓𬺓𬺓",""]
["","","","𬺓𬺓𬺓","","𬺓𬺓𬺓",""]
["","","","𬺓𬺓𬺓","","𬺓𬺓𬺓",""]
["","","","𬺓𬺓𬺓","","𬺓𬺓𬺓",""]
["","","","𬺓𬺓𬺓","","𬺓𬺓𬺓",""]
["","","","𬺓𬺓𬺓","","𬺓𬺓𬺓",""]
["","","","𬺓𬺓𬺓","","𬺓𬺓𬺓",""]
["","","","𬺓𬺓𬺓","","𬺓𬺓𬺓",""]
["","","","𬺓𬺓𬺓","","𬺓𬺓𬺓",""]
["","","","𬺓𬺓𬺓","","𬺓𬺓𬺓",""]
["","","","𬺓𬺓𬺓","","𬺓𬺓𬺓",""]
["","","","𬺓𬺓𬺓","","𬺓𬺓𬺓",""]
["","","","𬺓𬺓𬺓","","𬺓𬺓𬺓",""]
["","","","𬺓𬺓𬺓","","𬺓𬺓𬺓",""]
["","","","𬺓𬺓𬺓","","𬺓𬺓𬺓",""]
["","","","𬺓𬺓𬺓","","𬺓𬺓𬺓",""]
["","","","𬺓𬺓𬺓","","𬺓𬺓𬺓",""]
["","","","𬺓𬺓𬺓","","𬺓𬺓𬺓",""]
["","","","𬺓𬺓𬺓","","𬺓𬺓𬺓",""]
["","","","𬺓𬺓𬺓","","𬺓𬺓𬺓",""]
["","","","𬺓𬺓𬺓","","𬺓𬺓𬺓",""]
["","","","𬺓𬺓𬺓","","𬺓𬺓𬺓",""]
["","","","𬺓𬺓𬺓","","𬺓𬺓𬺓",""]
["","","","𬺓𬺓𬺓","","𬺓𬺓𬺓",""]
["","","","𬺓𬺓𬺓","","𬺓𬺓𬺓",""]
["","","","𬺓𬺓𬺓","","𬺓𬺓𬺓",""]
["","","","𬺓𬺓𬺓","","𬺓𬺓𬺓",""]
["","","","𬺓𬺓𬺓","","𬺓𬺓𬺓",""]
["","","","𬺓𬺓𬺓","","𬺓𬺓𬺓",""]
["","","","𬺓𬺓𬺓","","𬺓𬺓𬺓",""]
["","","","𬺓𬺓𬺓","","𬺓𬺓𬺓",""]
["","","","𬺓𬺓𬺓","","𬺓𬺓𬺓",""]
["","","","𬺓𬺓𬺓","","𬺓𬺓𬺓",""]
["","","","𬺓𬺓𬺓","","𬺓𬺓𬺓",""]
["","","","𬺓𬺓𬺓","","𬺓𬺓𬺓",""]
["","","","𬺓𬺓𬺓","","𬺓𬺓𬺓",""]
["","","","𬺓𬺓𬺓","","𬺓𬺓𬺓",""]
["","","","𬺓𬺓𬺓","","𬺓𬺓𬺓",""]
["","","","𬺓𬺓𬺓","","𬺓𬺓𬺓",""]
["","","","𬺓𬺓𬺓","","𬺓𬺓𬺓",""]
["","","","𬺓𬺓𬺓","","𬺓𬺓𬺓",""]
["","","","𬺓𬺓𬺓","","𬺓𬺓𬺓",""]
["","","","𬺓𬺓𬺓","","𬺓𬺓𬺓",""]
["","","","𬺓𬺓𬺓","","𬺓𬺓𬺓",""]
["","","","𬺓𬺓𬺓","","𬺓𬺓𬺓",""]
["","","","𬺓𬺓𬺓","","𬺓𬺓𬺓",""]
["","","","𬺓𬺓𬺓","","𬺓𬺓𬺓",""]
["","","","𬺓𬺓𬺓","","𬺓𬺓𬺓",""]
["","","","𬺓𬺓𬺓","","𬺓𬺓𬺓",""]
["","","","𬺓𬺓𬺓","","𬺓𬺓𬺓",""]
["","","","𬺓𬺓𬺓","","𬺓𬺓𬺓",""]
["","","","𬺓𬺓𬺓","","𬺓𬺓𬺓",""]
["","","","𬺓𬺓𬺓","","𬺓𬺓𬺓",""]
["","","","𬺓𬺓𬺓","","𬺓𬺓𬺓",""]
["","","","𬺓𬺓𬺓","","𬺓𬺓𬺓",""]
["","","","𬺓𬺓𬺓","","𬺓𬺓𬺓",""]
["","","","𬺓𬺓𬺓","","𬺓𬺓𬺓",""]
["","","","𬺓𬺓𬺓","","𬺓𬺓𬺓",""]
["","","","𬺓𬺓𬺓","","𬺓𬺓𬺓",""]
["","","","𬺓𬺓𬺓","","𬺓𬺓𬺓",""]
["","","","𬺓𬺓𬺓","","𬺓𬺓𬺓",""]
["","","","𬺓𬺓𬺓","","𬺓𬺓𬺓",""]
["","","","𬺓𬺓𬺓","","𬺓𬺓𬺓",""]
["","","","𬺓𬺓𬺓","","𬺓𬺓𬺓",""]
["","","","𬺓𬺓𬺓","","𬺓𬺓𬺓",""]
["","","","𬺓𬺓𬺓","","𬺓𬺓𬺓",""]
["","","","𬺓𬺓𬺓","","𬺓𬺓𬺓",""]
["","","","𬺓𬺓𬺓","","𬺓𬺓𬺓",""]
["","","","𬺓𬺓𬺓","","𬺓𬺓𬺓",""]
["","","","𬺓𬺓𬺓","","𬺓𬺓𬺓",""]
["","","","𬺓𬺓𬺓","","𬺓𬺓𬺓",""]
["","","","𬺓𬺓𬺓","","𬺓𬺓𬺓",""]
["","","","𬺓𬺓𬺓","","𬺓𬺓𬺓",""]
["","","","𬺓𬺓𬺓","","𬺓𬺓𬺓",""]
["","","","𬺓𬺓𬺓","","𬺓𬺓𬺓",""]
["","","","𬺓𬺓𬺓","","𬺓𬺓𬺓",""]
["","","","𬺓𬺓𬺓","","𬺓𬺓𬺓",""]
["","","","𬺓𬺓𬺓","","𬺓𬺓𬺓",""]
["","","","𬺓𬺓𬺓","","𬺓𬺓𬺓",""]
["","","","𬺓𬺓𬺓","","𬺓𬺓𬺓",""]
["","","","𬺓𬺓𬺓","","𬺓𬺓𬺓",""]
["","","","𬺓𬺓𬺓","","𬺓𬺓𬺓",""]
["","","","𬺓𬺓𬺓","","𬺓𬺓𬺓",""]
["","","","𬺓𬺓𬺓","","𬺓𬺓𬺓",""]
["","","","𬺓𬺓𬺓","","𬺓𬺓𬺓",""]
["","","","𬺓𬺓𬺓","","𬺓𬺓𬺓",""]
["","","","𬺓𬺓𬺓","","𬺓𬺓𬺓",""]
["","","","𬺓𬺓𬺓","","𬺓𬺓𬺓",""]
["","","","𬺓𬺓𬺓","","𬺓𬺓𬺓",""]
["","","","𬺓𬺓𬺓","","𬺓𬺓𬺓",""]
["","","","𬺓𬺓𬺓","","𬺓𬺓𬺓",""]
["","","","𬺓𬺓𬺓","","𬺓𬺓𬺓",""]
["","","","𬺓𬺓𬺓","","𬺓𬺓𬺓",""]
["","","","𬺓𬺓𬺓","","𬺓𬺓𬺓",""]
["","","","𬺓𬺓𬺓","","𬺓𬺓𬺓",""]
["","","","𬺓𬺓𬺓","","𬺓𬺓𬺓",""]
["","","","𬺓𬺓𬺓","","𬺓𬺓𬺓",""]
["","","","𬺓𬺓𬺓","","𬺓𬺓𬺓",""]
["","","","𬺓𬺓𬺓","","𬺓𬺓𬺓",""]
["","","","𬺓𬺓𬺓","","𬺓𬺓𬺓",""]
["","","","𬺓𬺓𬺓","","𬺓𬺓𬺓",""]
["","","","𬺓𬺓𬺓","","𬺓𬺓𬺓",""]
["","","","𬺓𬺓𬺓","","𬺓𬺓𬺓",""]
["","","","𬺓𬺓𬺓","","𬺓𬺓𬺓",""]
["","","","𬺓𬺓𬺓","","𬺓𬺓𬺓",""]
["","","","𬺓𬺓𬺓","","𬺓𬺓𬺓",""]
["","","","𬺓𬺓𬺓","","𬺓𬺓𬺓",""]
["","","","𬺓𬺓𬺓","","𬺓𬺓𬺓",""]
["","","","𬺓𬺓𬺓","","𬺓𬺓𬺓",""]
["","","","𬺓𬺓𬺓","","𬺓𬺓𬺓",""]
["","","","𬺓𬺓𬺓","","𬺓𬺓𬺓",""]
["","","","𬺓𬺓𬺓","","𬺓𬺓𬺓",""]
["","","","𬺓𬺓𬺓","","𬺓𬺓𬺓",""]
["","","","𬺓𬺓𬺓","","𬺓𬺓𬺓",""]
["","","","𬺓𬺓𬺓","","𬺓𬺓𬺓",""]
["","","","𬺓𬺓𬺓","","𬺓𬺓𬺓",""]
["","","","𬺓𬺓𬺓","","𬺓𬺓𬺓",""]
["","","","𬺓𬺓𬺓","","𬺓𬺓𬺓",""]
["","","","𬺓𬺓𬺓","","𬺓𬺓𬺓",""]
["","","","𬺓𬺓𬺓","","𬺓𬺓𬺓",""]
["","","","𬺓𬺓𬺓","","𬺓𬺓𬺓",""]
["","","","𬺓𬺓𬺓","","𬺓𬺓𬺓",""]
["","","","𬺓𬺓𬺓","","𬺓𬺓𬺓",""]
["","","","𬺓𬺓𬺓","","𬺓𬺓𬺓",""]
["","","","𬺓𬺓𬺓","","𬺓𬺓𬺓",""]
["","","","𬺓𬺓𬺓","","𬺓𬺓𬺓",""]
["","","","𬺓𬺓𬺓","","𬺓𬺓𬺓",""]
["","","","𬺓𬺓𬺓","","𬺓𬺓𬺓",""]
["","","","𬺓𬺓𬺓","","𬺓𬺓𬺓",""]
["","","","𬺓𬺓𬺓","","𬺓𬺓𬺓",""]
["","","","𬺓𬺓𬺓","","𬺓𬺓𬺓",""]
["","","","𬺓𬺓𬺓","","𬺓𬺓𬺓",""]
["","","","𬺓𬺓𬺓","","𬺓𬺓𬺓",""]
["","","","𬺓𬺓𬺓","","𬺓𬺓𬺓",""]
["","","","𬺓𬺓𬺓","","𬺓𬺓𬺓",""]
["","","","𬺓𬺓𬺓","","𬺓𬺓𬺓",""]
["","","","𬺓𬺓𬺓","","𬺓𬺓𬺓",""]
["","","","𬺓𬺓𬺓","","𬺓𬺓𬺓",""]
["","","","𬺓𬺓𬺓","","𬺓𬺓𬺓",""]
["","","","𬺓𬺓𬺓","","𬺓𬺓𬺓",""]
["","","","𬺓𬺓𬺓","","𬺓𬺓𬺓",""]
["","","","𬺓𬺓𬺓","","𬺓𬺓𬺓",""]
["","","","𬺓𬺓𬺓","","𬺓𬺓𬺓",""]
["","","","𬺓𬺓𬺓","","𬺓𬺓𬺓",""]
["","","","𬺓𬺓𬺓","","𬺓𬺓𬺓",""]
["","","","𬺓𬺓𬺓","","𬺓𬺓𬺓",""]
["","","","𬺓𬺓𬺓","","𬺓𬺓𬺓",""]
["","","","𬺓𬺓𬺓","","𬺓𬺓𬺓",""]
["","","","𬺓𬺓𬺓","","𬺓𬺓𬺓",""]
["","","","𬺓𬺓𬺓","","𬺓𬺓𬺓",""]
["","","","𬺓𬺓𬺓","","𬺓𬺓𬺓",""]
["","","","𬺓𬺓𬺓","","𬺓𬺓𬺓",""]
["","","","𬺓𬺓𬺓","","𬺓𬺓𬺓",""]
["","","","𬺓𬺓𬺓","","𬺓𬺓𬺓",""]
["","","","𬺓𬺓𬺓","","𬺓𬺓𬺓",""]
["","","","𬺓𬺓𬺓","","𬺓𬺓𬺓",""]
["","","","𬺓𬺓𬺓","","𬺓𬺓𬺓",""]
["","","","𬺓𬺓𬺓","","𬺓𬺓𬺓",""]
["","","","𬺓𬺓𬺓","","𬺓𬺓𬺓",""]
["","","","𬺓𬺓𬺓","","𬺓𬺓𬺓",""]
["","","","𬺓𬺓𬺓","","𬺓𬺓𬺓",""]

{"sheet":"Notes","index":4,"n_rows":1,"n_cols":7,"rows_kept":1}
["Notes",{"$nulls":5},"Versió 2.9"]

{"sheet":"formula","index":5,"n_rows":4,"n_cols":26,"rows_kept":4,"hidden":true}
["Because TEXTJOIN doesn't seem to work in an array formula, I am creating the equivalent function here for the \"expenses grouped\" tab."]
[{"$nulls":3},"D","E","F","G","H","I","J","K","L","M","N","O","P","Q","R","S","T","U","V","W","X","Y","Z"]
[null,"IF($'Record Expenses'.B5:B850 = \"\", \"\",  $'Record Expenses'.B5:B850 & \"     \") &",null,{"$f":"SUBSTITUTE($B3,\"B\",D2)","v":"IF($'Record Expenses'.D5:D850 = \"\", \"\",  $'Record Expenses'.D5:D850 & \"     \") &"},"IF($'Record Expenses'.E5:E850 = \"\", \"\",  $'Record Expenses'.E5:E850 & \"     \") &","IF($'Record Expenses'.F5:F850 = \"\", \"\",  $'Record Expenses'.F5:F850 & \"     \") &","IF($'Record Expenses'.G5:G850 = \"\", \"\",  $'Record Expenses'.G5:G850 & \"     \") &","IF($'Record Expenses'.H5:H850 = \"\", \"\",  $'Record Expenses'.H5:H850 & \"     \") &","IF($'Record Expenses'.I5:I850 = \"\", \"\",  $'Record Expenses'.I5:I850 & \"     \") &","IF($'Record Expenses'.J5:J850 = \"\", \"\",  $'Record Expenses'.J5:J850 & \"     \") &","IF($'Record Expenses'.K5:K850 = \"\", \"\",  $'Record Expenses'.K5:K850 & \"     \") &","IF($'Record Expenses'.L5:L850 = \"\", \"\",  $'Record Expenses'.L5:L850 & \"     \") &","IF($'Record Expenses'.M5:M850 = \"\", \"\",  $'Record Expenses'.M5:M850 & \"     \") &","IF($'Record Expenses'.N5:N850 = \"\", \"\",  $'Record Expenses'.N5:N850 & \"     \") &","IF($'Record Expenses'.O5:O850 = \"\", \"\",  $'Record Expenses'.O5:O850 & \"     \") &","IF($'Record Expenses'.P5:P850 = \"\", \"\",  $'Record Expenses'.P5:P850 & \"     \") &","IF($'Record Expenses'.Q5:Q850 = \"\", \"\",  $'Record Expenses'.Q5:Q850 & \"     \") &","IF($'Record Expenses'.R5:R850 = \"\", \"\",  $'Record Expenses'.R5:R850 & \"     \") &","IF($'Record Expenses'.S5:S850 = \"\", \"\",  $'Record Expenses'.S5:S850 & \"     \") &","IF($'Record Expenses'.T5:T850 = \"\", \"\",  $'Record Expenses'.T5:T850 & \"     \") &","IF($'Record Expenses'.U5:U850 = \"\", \"\",  $'Record Expenses'.U5:U850 & \"     \") &","IF($'Record Expenses'.V5:V850 = \"\", \"\",  $'Record Expenses'.V5:V850 & \"     \") &","IF($'Record Expenses'.W5:W850 = \"\", \"\",  $'Record Expenses'.W5:W850 & \"     \") &","IF($'Record Expenses'.X5:X850 = \"\", \"\",  $'Record Expenses'.X5:X850 & \"     \") &","IF($'Record Expenses'.Y5:Y850 = \"\", \"\",  $'Record Expenses'.Y5:Y850 & \"     \") &","IF($'Record Expenses'.Z5:Z850 = \"\", \"\",  $'Record Expenses'.Z5:Z850 & \"     \") &"]
["actual formula: ","'=IF($'Record Expenses'.C5:C850=\"\",\"\", IF($'Record Expenses'.B5:B850 = \"\", \"\",  $'Record Expenses'.B5:B850 & \"     \") &  IF($'Record Expenses'.D5:D850 = \"\", \"\",  $'Record Expenses'.D5:D850 & \"     \") & IF($'Record Expenses'.E5:E850 = \"\", \"\",  $'Record Expenses'.E5:E850 & \"     \") & IF($'Record Expenses'.F5:F850 = \"\", \"\",  $'Record Expenses'.F5:F850 & \"     \") & IF($'Record Expenses'.G5:G850 = \"\", \"\",  $'Record Expenses'.G5:G850 & \"     \") & IF($'Record Expenses'.H5:H850 = \"\", \"\",  $'Record Expenses'.H5:H850 & \"     \") & IF($'Record Expenses'.I5:I850 = \"\", \"\",  $'Record Expenses'.I5:I850 & \"     \") & IF($'Record Expenses'.J5:J850 = \"\", \"\",  $'Record Expenses'.J5:J850 & \"     \") & IF($'Record Expenses'.K5:K850 = \"\", \"\",  $'Record Expenses'.K5:K850 & \"     \") & IF($'Record Expenses'.L5:L850 = \"\", \"\",  $'Record Expenses'.L5:L850 & \"     \") & IF($'Record Expenses'.M5:M850 = \"\", \"\",  $'Record Expenses'.M5:M850 & \"     \") & IF($'Record Expenses'.N5:N850 = \"\", \"\",  $'Record Expenses'.N5:N850 & \"     \") & IF($'Record Expenses'.O5:O850 = \"\", \"\",  $'Record Expenses'.O5:O850 & \"     \") & IF($'Record Expenses'.P5:P850 = \"\", \"\",  $'Record Expenses'.P5:P850 & \"     \") & IF($'Record Expenses'.Q5:Q850 = \"\", \"\",  $'Record Expenses'.Q5:Q850 & \"     \") & IF($'Record Expenses'.R5:R850 = \"\", \"\",  $'Record Expenses'.R5:R850 & \"     \") & IF($'Record Expenses'.S5:S850 = \"\", \"\",  $'Record Expenses'.S5:S850 & \"     \") & IF($'Record Expenses'.T5:T850 = \"\", \"\",  $'Record Expenses'.T5:T850 & \"     \") & IF($'Record Expenses'.U5:U850 = \"\", \"\",  $'Record Expenses'.U5:U850 & \"     \") & IF($'Record Expenses'.V5:V850 = \"\", \"\",  $'Record Expenses'.V5:V850 & \"     \") & IF($'Record Expenses'.W5:W850 = \"\", \"\",  $'Record Expenses'.W5:W850 & \"     \") & IF($'Record Expenses'.X5:X850 = \"\", \"\",  $'Record Expenses'.X5:X850 & \"     \") & IF($'Record Expenses'.Y5:Y850 = \"\", \"\",  $'Record Expenses'.Y5:Y850 & \"     \") & IF($'Record Expenses'.Z5:Z850 = \"\", \"\",  $'Record Expenses'.Z5:Z850 & \"     \")  )"]